null
SMILES: Cc1c(OCc2cccc(F)c2)cccc1N1CCNCC1
InChI Key: InChIKey=OCBDZACGCYLWIA-UHFFFAOYSA-N
Activity Spreadsheet -- Enzyme Inhibition Constant Data from BindingDB
Found 1 hit for monomerid = 28585
Trg + Lig
Ki
nM
ΔG°
kcal/mole
IC50
nM
Kd
nM
EC50/IC50
nM
koff
s-1
kon
M-1s-1
pHTemp
°C
5-hydroxytryptamine receptor 6
(Homo sapiens (Human))
BDBM28585
(1-{3-[(3-fluorophenyl)methoxy]-2-methylphenyl}pipe...)
Show SMILES Cc1c(OCc2cccc(F)c2)cccc1N1CCNCC1
Show InChI InChI=1S/C18H21FN2O/c1-14-17(21-10-8-20-9-11-21)6-3-7-18(14)22-13-15-4-2-5-16(19)12-15/h2-7,12,20H,8-11,13H2,1H3
Reactome pathway
10.3 -10.8n/an/an/an/an/a7.522
Pfizer
Assay Description
Competition experiments were performed in the presence radioligand with membrane protein (obtained from cells expressing the receptor) and test compo...
Bioorg Med Chem Lett 19: 2409-12 (2009)
Article DOI: 10.1016/j.bmcl.2009.03.077
BindingDB Entry DOI: 10.7270/Q24T6GP5