null
SMILES: Cc1c(OCc2ccccc2F)cccc1N1CCNCC1
InChI Key: InChIKey=GATQWJLXNBMEEE-UHFFFAOYSA-N
Activity Spreadsheet -- Enzyme Inhibition Constant Data from BindingDB
Found 1 hit for monomerid = 28588
Trg + Lig
Ki
nM
ΔG°
kcal/mole
IC50
nM
Kd
nM
EC50/IC50
nM
koff
s-1
kon
M-1s-1
pHTemp
°C
5-hydroxytryptamine receptor 6
(Homo sapiens (Human))
BDBM28588
(1-{3-[(2-fluorophenyl)methoxy]-2-methylphenyl}pipe...)
Show SMILES Cc1c(OCc2ccccc2F)cccc1N1CCNCC1
Show InChI InChI=1S/C18H21FN2O/c1-14-17(21-11-9-20-10-12-21)7-4-8-18(14)22-13-15-5-2-3-6-16(15)19/h2-8,20H,9-13H2,1H3
Reactome pathway
11.6 -10.7n/an/an/an/an/a7.522
Pfizer
Assay Description
Competition experiments were performed in the presence radioligand with membrane protein (obtained from cells expressing the receptor) and test compo...
Bioorg Med Chem Lett 19: 2409-12 (2009)
Article DOI: 10.1016/j.bmcl.2009.03.077
BindingDB Entry DOI: 10.7270/Q24T6GP5