null
SMILES: Cc1c(OCc2cccc(Cl)c2)cccc1C1CCNCC1
InChI Key: InChIKey=OFJXQWHRWCTSTK-UHFFFAOYSA-N
Activity Spreadsheet -- Enzyme Inhibition Constant Data from BindingDB
Found 1 hit for monomerid = 28595
Trg + Lig
Ki
nM
ΔG°
kcal/mole
IC50
nM
Kd
nM
EC50/IC50
nM
koff
s-1
kon
M-1s-1
pHTemp
°C
5-hydroxytryptamine receptor 6
(Homo sapiens (Human))
BDBM28595
(4-{3-[(3-chlorophenyl)methoxy]-2-methylphenyl}pipe...)
Show SMILES Cc1c(OCc2cccc(Cl)c2)cccc1C1CCNCC1
Show InChI InChI=1S/C19H22ClNO/c1-14-18(16-8-10-21-11-9-16)6-3-7-19(14)22-13-15-4-2-5-17(20)12-15/h2-7,12,16,21H,8-11,13H2,1H3
Reactome pathway
3.30 -11.4n/an/an/an/an/a7.522
Pfizer
Assay Description
Competition experiments were performed in the presence radioligand with membrane protein (obtained from cells expressing the receptor) and test compo...
Bioorg Med Chem Lett 19: 2409-12 (2009)
Article DOI: 10.1016/j.bmcl.2009.03.077
BindingDB Entry DOI: 10.7270/Q24T6GP5