null
SMILES: CCC(Oc1nccc(C2CCNCC2)c1C)c1cccc(Cl)c1
InChI Key: InChIKey=YXJZUDFVSPPNEB-UHFFFAOYSA-N
Activity Spreadsheet -- Enzyme Inhibition Constant Data from BindingDB
Found 1 hit for monomerid = 28619
Trg + Lig
Ki
nM
ΔG°
kcal/mole
IC50
nM
Kd
nM
EC50/IC50
nM
koff
s-1
kon
M-1s-1
pHTemp
°C
5-hydroxytryptamine receptor 6
(Homo sapiens (Human))
BDBM28619
(2-[1-(3-chlorophenyl)propoxy]-3-methyl-4-(piperidi...)
Show SMILES CCC(Oc1nccc(C2CCNCC2)c1C)c1cccc(Cl)c1
Show InChI InChI=1S/C20H25ClN2O/c1-3-19(16-5-4-6-17(21)13-16)24-20-14(2)18(9-12-23-20)15-7-10-22-11-8-15/h4-6,9,12-13,15,19,22H,3,7-8,10-11H2,1-2H3
Reactome pathway
6.40 -11.2n/an/an/an/an/an/a25
Pfizer
Assay Description
Competition experiments were performed in the presence radioligand with membrane protein (obtained from cells expressing the receptor) and test compo...
Bioorg Med Chem Lett 19: 2409-12 (2009)
Article DOI: 10.1016/j.bmcl.2009.03.077
BindingDB Entry DOI: 10.7270/Q24T6GP5