BDBM286221 6-fluoro-3-methyl-2-(5- methoxypyridin-3- yl)imidazo[1,2-a]pyridine::US9518055, Example 18
SMILES: COc1cncc(c1)-c1nc2ccc(F)cn2c1C
InChI Key: InChIKey=SZBAIFHYRBMLFH-UHFFFAOYSA-N
Data: 2 IC50
Activity Spreadsheet -- Enzyme Inhibition Constant Data from BindingDB
Found 2 hits for monomerid = 286221
Trg + Lig
Ki
nM
ΔG°
kcal/mole
IC50
nM
Kd
nM
EC50/IC50
nM
koff
s-1
kon
M-1s-1
pHTemp
°C
Cytochrome P450 11B1, mitochondrial
(Homo sapiens (Human))
BDBM286221
(6-fluoro-3-methyl-2-(5- methoxypyridin-3- yl)imida...)
Show SMILES COc1cncc(c1)-c1nc2ccc(F)cn2c1C
Show InChI InChI=1S/C14H12FN3O/c1-9-14(10-5-12(19-2)7-16-6-10)17-13-4-3-11(15)8-18(9)13/h3-8H,1-2H3
US Patent
n/an/a 32.4n/an/an/an/an/an/a
Merck Sharp & Dohme
US Patent
Assay Description
V79 cell lines stably expressing the either the human CYP11B2 or the human CYP11B1 enzyme were generated using a standard transfection protocol. V79 ...
US Patent US9518055 (2016)
BindingDB Entry DOI: 10.7270/Q23B625B
Cytochrome P450 11B2, mitochondrial
(Homo sapiens (Human))
BDBM286221
(6-fluoro-3-methyl-2-(5- methoxypyridin-3- yl)imida...)
Show SMILES COc1cncc(c1)-c1nc2ccc(F)cn2c1C
Show InChI InChI=1S/C14H12FN3O/c1-9-14(10-5-12(19-2)7-16-6-10)17-13-4-3-11(15)8-18(9)13/h3-8H,1-2H3
US Patent
n/an/a 0.300n/an/an/an/an/an/a
Merck Sharp & Dohme
US Patent
Assay Description
V79 cell lines stably expressing the either the human CYP11B2 or the human CYP11B1 enzyme were generated using a standard transfection protocol. V79 ...
US Patent US9518055 (2016)
BindingDB Entry DOI: 10.7270/Q23B625B