null
SMILES: CCNc1ncc(F)c(Nc2n[nH]c3c2CN(C(=O)N2C[C@@H](C)N(C)C[C@@H]2C)C3(C)C)n1
InChI Key: InChIKey=PVJVEBBWSBNEJJ-OLZOCXBDSA-N
Activity Spreadsheet -- Enzyme Inhibition Constant Data from BindingDB
Found 2 hits for monomerid = 286260
Trg + Lig
Ki
nM
ΔG°
kcal/mole
IC50
nM
Kd
nM
EC50/IC50
nM
koff
s-1
kon
M-1s-1
pHTemp
°C
Protein kinase C beta type
(Homo sapiens (Human))
BDBM286260
(US11220518, Ex. No. B3 | US9518060, Example B3)
Show SMILES CCNc1ncc(F)c(Nc2n[nH]c3c2CN(C(=O)N2C[C@@H](C)N(C)C[C@@H]2C)C3(C)C)n1 |r|
Show InChI InChI=1S/C21H32FN9O/c1-7-23-19-24-8-15(22)18(26-19)25-17-14-11-31(21(4,5)16(14)27-28-17)20(32)30-10-12(2)29(6)9-13(30)3/h8,12-13H,7,9-11H2,1-6H3,(H3,23,24,25,26,27,28)/t12-,13+/m1/s1
NCI pathway
Reactome pathway
2.03n/an/an/an/an/an/an/an/a
TBA
Citation and Details
Protein-tyrosine kinase 2-beta
(Homo sapiens (Human))
BDBM286260
(US11220518, Ex. No. B3 | US9518060, Example B3)
Show SMILES CCNc1ncc(F)c(Nc2n[nH]c3c2CN(C(=O)N2C[C@@H](C)N(C)C[C@@H]2C)C3(C)C)n1 |r|
Show InChI InChI=1S/C21H32FN9O/c1-7-23-19-24-8-15(22)18(26-19)25-17-14-11-31(21(4,5)16(14)27-28-17)20(32)30-10-12(2)29(6)9-13(30)3/h8,12-13H,7,9-11H2,1-6H3,(H3,23,24,25,26,27,28)/t12-,13+/m1/s1
US Patent
2.03n/an/an/an/an/an/a7.4n/a
PFIZER INC.
US Patent
Assay Description
Protein Kinase C beta 2 (PKCβII) catalyzes the production of ADP from ATP that accompanies the phosphoryl transfer to the PKC Pseudosubstrate pe...
US Patent US9518060 (2016)
BindingDB Entry DOI: 10.7270/Q2ZK5JPN