null
SMILES: Cc1c(OS(=O)(=O)c2ccccc2F)cccc1C1CCNCC1
InChI Key: InChIKey=FUZDXWRHGNUUJD-UHFFFAOYSA-N
Activity Spreadsheet -- Enzyme Inhibition Constant Data from BindingDB
Found 1 hit for monomerid = 28630
Trg + Lig
Ki
nM
ΔG°
kcal/mole
IC50
nM
Kd
nM
EC50/IC50
nM
koff
s-1
kon
M-1s-1
pHTemp
°C
5-hydroxytryptamine receptor 6
(Homo sapiens (Human))
BDBM28630
(2-methyl-3-(piperidin-4-yl)phenyl 2-fluorobenzene-...)
Show SMILES Cc1c(OS(=O)(=O)c2ccccc2F)cccc1C1CCNCC1
Show InChI InChI=1S/C18H20FNO3S/c1-13-15(14-9-11-20-12-10-14)5-4-7-17(13)23-24(21,22)18-8-3-2-6-16(18)19/h2-8,14,20H,9-12H2,1H3
Reactome pathway
13.6 -10.7n/an/an/an/an/an/a25
Pfizer
Assay Description
Competition experiments were performed in the presence radioligand with membrane protein (obtained from cells expressing the receptor) and test compo...
Bioorg Med Chem Lett 19: 2409-12 (2009)
Article DOI: 10.1016/j.bmcl.2009.03.077
BindingDB Entry DOI: 10.7270/Q24T6GP5