null
SMILES: CCc1ccc(cc1)S(=O)(=O)Oc1cccc(C2CCNCC2)c1C
InChI Key: InChIKey=WZAUTVLYMJAUGI-UHFFFAOYSA-N
Activity Spreadsheet -- Enzyme Inhibition Constant Data from BindingDB
Found 1 hit for monomerid = 28634
Trg + Lig
Ki
nM
ΔG°
kcal/mole
IC50
nM
Kd
nM
EC50/IC50
nM
koff
s-1
kon
M-1s-1
pHTemp
°C
5-hydroxytryptamine receptor 6
(Homo sapiens (Human))
BDBM28634
(2-methyl-3-(piperidin-4-yl)phenyl 4-ethylbenzene-1...)
Show SMILES CCc1ccc(cc1)S(=O)(=O)Oc1cccc(C2CCNCC2)c1C
Show InChI InChI=1S/C20H25NO3S/c1-3-16-7-9-18(10-8-16)25(22,23)24-20-6-4-5-19(15(20)2)17-11-13-21-14-12-17/h4-10,17,21H,3,11-14H2,1-2H3
Reactome pathway
11.3 -10.8n/an/an/an/an/an/a25
Pfizer
Assay Description
Competition experiments were performed in the presence radioligand with membrane protein (obtained from cells expressing the receptor) and test compo...
Bioorg Med Chem Lett 19: 2409-12 (2009)
Article DOI: 10.1016/j.bmcl.2009.03.077
BindingDB Entry DOI: 10.7270/Q24T6GP5