BDBM286344 US9518060, Example K2
SMILES: CCOc1ccc(F)c(Nc2n[nH]c3c2CN(C(=O)N2C[C@@H](C)N(CC)C[C@@H]2C)C3(C)C)n1
InChI Key:
Data: 1 KI
Activity Spreadsheet -- Enzyme Inhibition Constant Data from BindingDB
Found 1 hit for monomerid = 286344
Trg + Lig
Ki
nM
ΔG°
kcal/mole
IC50
nM
Kd
nM
EC50/IC50
nM
koff
s-1
kon
M-1s-1
pHTemp
°C
PTK2B protein tyrosine kinase 2 beta (PTK2B)
(Homo sapiens (Human))
BDBM286344
(US9518060, Example K2)
Show SMILES CCOc1ccc(F)c(Nc2n[nH]c3c2CN(C(=O)N2C[C@@H](C)N(CC)C[C@@H]2C)C3(C)C)n1 |r|
US Patent
2.11n/an/an/an/an/an/a7.4n/a
PFIZER INC.
US Patent
Assay Description
Protein Kinase C beta 2 (PKCβII) catalyzes the production of ADP from ATP that accompanies the phosphoryl transfer to the PKC Pseudosubstrate pe...
US Patent US9518060 (2016)
BindingDB Entry DOI: 10.7270/Q2ZK5JPN