BDBM286442 US9518064, Example 58
SMILES: COCOc1cnc(cn1)-c1cccc(COc2cc(OC)cc3oc(cc23)-c2cn3nc(OC)sc3n2)c1
InChI Key: InChIKey=CIJUDSYPSMOAMT-UHFFFAOYSA-N
Data: 1 IC50
Activity Spreadsheet -- Enzyme Inhibition Constant Data from BindingDB
Found 1 hit for monomerid = 286442
Trg + Lig
Ki
nM
ΔG°
kcal/mole
IC50
nM
Kd
nM
EC50/IC50
nM
koff
s-1
kon
M-1s-1
pHTemp
°C
Proteinase-activated receptor 4
(Homo sapiens (Human))
BDBM286442
(US9518064, Example 58)
Show SMILES COCOc1cnc(cn1)-c1cccc(COc2cc(OC)cc3oc(cc23)-c2cn3nc(OC)sc3n2)c1
Show InChI InChI=1S/C27H23N5O6S/c1-33-15-37-25-12-28-20(11-29-25)17-6-4-5-16(7-17)14-36-22-8-18(34-2)9-23-19(22)10-24(38-23)21-13-32-26(30-21)39-27(31-32)35-3/h4-13H,14-15H2,1-3H3
US Patent
n/an/a 1.22n/an/an/an/an/a25
Bristol-Myers Squibb Company; Universite De Montreal
US Patent
Assay Description
The activity of the PAR4 antagonists of the present invention were tested in PAR4 expressing cells by monitoring H-Ala-Phe(4-F)-Pro-Gly-Trp-Leu-Val-L...
US Patent US9518064 (2016)
BindingDB Entry DOI: 10.7270/Q2TT4SZX