BDBM286477 4-(6-(((6-Methoxy-2-(2-methoxyimidazo[2,1-b][1,3,4]thiadiazol-6-yl)benzofuran-4-yl)oxy)methyl)pyridin-2-yl)-N,N-dimethylbenzamide::US9518064, Example 96
SMILES: COc1nn2cc(nc2s1)-c1cc2c(OCc3cccc(n3)-c3ccc(cc3)C(=O)N(C)C)cc(OC)cc2o1
InChI Key: InChIKey=ULAVANHVRNZHHE-UHFFFAOYSA-N
Data: 1 IC50
Activity Spreadsheet -- Enzyme Inhibition Constant Data from BindingDB
Found 1 hit for monomerid = 286477
Trg + Lig
Ki
nM
ΔG°
kcal/mole
IC50
nM
Kd
nM
EC50/IC50
nM
koff
s-1
kon
M-1s-1
pHTemp
°C
Proteinase-activated receptor 4
(Homo sapiens (Human))
BDBM286477
(4-(6-(((6-Methoxy-2-(2-methoxyimidazo[2,1-b][1,3,4...)
Show SMILES COc1nn2cc(nc2s1)-c1cc2c(OCc3cccc(n3)-c3ccc(cc3)C(=O)N(C)C)cc(OC)cc2o1
Show InChI InChI=1S/C29H25N5O5S/c1-33(2)27(35)18-10-8-17(9-11-18)22-7-5-6-19(30-22)16-38-24-12-20(36-3)13-25-21(24)14-26(39-25)23-15-34-28(31-23)40-29(32-34)37-4/h5-15H,16H2,1-4H3
US Patent
n/an/a 0.230n/an/an/an/an/a25
Bristol-Myers Squibb Company; Universite De Montreal
US Patent
Assay Description
The activity of the PAR4 antagonists of the present invention were tested in PAR4 expressing cells by monitoring H-Ala-Phe(4-F)-Pro-Gly-Trp-Leu-Val-L...
US Patent US9518064 (2016)
BindingDB Entry DOI: 10.7270/Q2TT4SZX