BDBM286482 2-Methoxy-6-(6-methoxy-4-((2-phenylpyrimidin-4-yl)methoxy)benzofuran-2-yl)imidazo[2,1-b][1,3,4]thiadiazole::US9518064, Example 101
SMILES: COc1nn2cc(nc2s1)-c1cc2c(OCc3ccnc(n3)-c3ccccc3)cc(OC)cc2o1
InChI Key: InChIKey=UNPQYHPCORNOFB-UHFFFAOYSA-N
Data: 1 IC50
Activity Spreadsheet -- Enzyme Inhibition Constant Data from BindingDB
Found 1 hit for monomerid = 286482
Trg + Lig
Ki
nM
ΔG°
kcal/mole
IC50
nM
Kd
nM
EC50/IC50
nM
koff
s-1
kon
M-1s-1
pHTemp
°C
Proteinase-activated receptor 4 (PAR4)
(Homo sapiens (Human))
BDBM286482
(2-Methoxy-6-(6-methoxy-4-((2-phenylpyrimidin-4-yl)...)
Show SMILES COc1nn2cc(nc2s1)-c1cc2c(OCc3ccnc(n3)-c3ccccc3)cc(OC)cc2o1
Show InChI InChI=1S/C25H19N5O4S/c1-31-17-10-20(33-14-16-8-9-26-23(27-16)15-6-4-3-5-7-15)18-12-22(34-21(18)11-17)19-13-30-24(28-19)35-25(29-30)32-2/h3-13H,14H2,1-2H3
US Patent
n/an/a 0.920n/an/an/an/an/a25
Bristol-Myers Squibb Company; Universite De Montreal
US Patent
Assay Description
The activity of the PAR4 antagonists of the present invention were tested in PAR4 expressing cells by monitoring H-Ala-Phe(4-F)-Pro-Gly-Trp-Leu-Val-L...
US Patent US9518064 (2016)
BindingDB Entry DOI: 10.7270/Q2TT4SZX