BDBM286483 US9518064, Example 102
SMILES: COc1nn2cc(nc2s1)-c1cc2c(OCc3ccnc(n3)-c3csc(C)n3)cc(OC)cc2o1
InChI Key: InChIKey=BWNFRJUFQRULMP-UHFFFAOYSA-N
Data: 1 IC50
Activity Spreadsheet -- Enzyme Inhibition Constant Data from BindingDB
Found 1 hit for monomerid = 286483
Trg + Lig
Ki
nM
ΔG°
kcal/mole
IC50
nM
Kd
nM
EC50/IC50
nM
koff
s-1
kon
M-1s-1
pHTemp
°C
Proteinase-activated receptor 4 (PAR4)
(Homo sapiens (Human))
BDBM286483
(US9518064, Example 102)
Show SMILES COc1nn2cc(nc2s1)-c1cc2c(OCc3ccnc(n3)-c3csc(C)n3)cc(OC)cc2o1
Show InChI InChI=1S/C23H18N6O4S2/c1-12-25-17(11-34-12)21-24-5-4-13(26-21)10-32-18-6-14(30-2)7-19-15(18)8-20(33-19)16-9-29-22(27-16)35-23(28-29)31-3/h4-9,11H,10H2,1-3H3
US Patent
n/an/a 0.720n/an/an/an/an/a25
Bristol-Myers Squibb Company; Universite De Montreal
US Patent
Assay Description
The activity of the PAR4 antagonists of the present invention were tested in PAR4 expressing cells by monitoring H-Ala-Phe(4-F)-Pro-Gly-Trp-Leu-Val-L...
US Patent US9518064 (2016)
BindingDB Entry DOI: 10.7270/Q2TT4SZX