null
SMILES: COc1nn2cc(nc2s1)-c1cc2c(OCc3cccc(n3)C3(F)CCOCC3)cc(OC)cc2o1
InChI Key: InChIKey=ZOBNFMADQCZZIH-UHFFFAOYSA-N
Activity Spreadsheet -- Enzyme Inhibition Constant Data from BindingDB
Found 1 hit for monomerid = 286494
Trg + Lig
Ki
nM
ΔG°
kcal/mole
IC50
nM
Kd
nM
EC50/IC50
nM
koff
s-1
kon
M-1s-1
pHTemp
°C
Proteinase-activated receptor 4
(Homo sapiens (Human))
BDBM286494
(6-(4-((6-(4-Fluorotetrahydro-2H-pyran-4-yl)pyridin...)
Show SMILES COc1nn2cc(nc2s1)-c1cc2c(OCc3cccc(n3)C3(F)CCOCC3)cc(OC)cc2o1
Show InChI InChI=1S/C25H23FN4O5S/c1-31-16-10-19(34-14-15-4-3-5-22(27-15)25(26)6-8-33-9-7-25)17-12-21(35-20(17)11-16)18-13-30-23(28-18)36-24(29-30)32-2/h3-5,10-13H,6-9,14H2,1-2H3
US Patent
n/an/a 0.350n/an/an/an/an/a25
Bristol-Myers Squibb Company; Universite De Montreal
US Patent
Assay Description
The activity of the PAR4 antagonists of the present invention were tested in PAR4 expressing cells by monitoring H-Ala-Phe(4-F)-Pro-Gly-Trp-Leu-Val-L...
US Patent US9518064 (2016)
BindingDB Entry DOI: 10.7270/Q2TT4SZX