null
SMILES: CC[C@H](NC(=O)[C@H]([C@H](O)[C@H](C)C\C=C\C)N(C)C(=O)[C@H](C(C)C)N(C)C(=O)[C@H](CC(C)C)N(C)C(=O)[C@H](CC(C)C)N(C)C(=O)[C@@H](C)NC(=O)[C@H](C)NC(=O)[C@H](CC(C)C)N(C)C(=O)[C@@H](NC(=O)[C@@H](NC)[C@H](C)COCC(=O)N1CCNCC1)C(C)C)C(=O)N(C)[C@H](C)C(C)=O
InChI Key: InChIKey=ZINWLWRETZUIDE-UFPMSENESA-N
Activity Spreadsheet -- Enzyme Inhibition Constant Data from BindingDB
Found 3 hits for monomerid = 286555
Trg + Lig
Ki
nM
ΔG°
kcal/mole
IC50
nM
Kd
nM
EC50/IC50
nM
koff
s-1
kon
M-1s-1
pHTemp
°C
Peptidyl-prolyl cis-trans isomerase A
(Homo sapiens (Human))
BDBM286555
(US9566312, Compound 2.6.1)
Show SMILES CC[C@H](NC(=O)[C@H]([C@H](O)[C@H](C)C\C=C\C)N(C)C(=O)[C@H](C(C)C)N(C)C(=O)[C@H](CC(C)C)N(C)C(=O)[C@H](CC(C)C)N(C)C(=O)[C@@H](C)NC(=O)[C@H](C)NC(=O)[C@H](CC(C)C)N(C)C(=O)[C@@H](NC(=O)[C@@H](NC)[C@H](C)COCC(=O)N1CCNCC1)C(C)C)C(=O)N(C)[C@H](C)C(C)=O |r|
Show InChI InChI=1S/C69H125N13O14/c1-26-28-29-44(13)59(85)58(63(89)74-50(27-2)65(91)76(20)48(17)49(18)83)81(25)69(95)57(43(11)12)80(24)67(93)53(36-41(7)8)79(23)66(92)52(35-40(5)6)78(22)64(90)47(16)73-60(86)46(15)72-61(87)51(34-39(3)4)77(21)68(94)55(42(9)10)75-62(88)56(70-19)45(14)37-96-38-54(84)82-32-30-71-31-33-82/h26,28,39-48,50-53,55-59,70-71,85H,27,29-38H2,1-25H3,(H,72,87)(H,73,86)(H,74,89)(H,75,88)/b28-26+/t44-,45-,46+,47-,48-,50+,51+,52+,53+,55+,56+,57+,58+,59-/m1/s1
Reactome pathway
US Patent
n/an/an/a 1n/an/an/a7.4n/a
Novartis AG
US Patent
Assay Description
Binding of inhibitors to expressed cyclophilins was determined using surface plasmon resonance (SPR) experiments. Briefly, avi-tagged cyclophilin pro...
US Patent US9566312 (2017)
BindingDB Entry DOI: 10.7270/Q2K939J1
Peptidyl-prolyl cis-trans isomerase F, mitochondrial
(Homo sapiens (Human))
BDBM286555
(US9566312, Compound 2.6.1)
Show SMILES CC[C@H](NC(=O)[C@H]([C@H](O)[C@H](C)C\C=C\C)N(C)C(=O)[C@H](C(C)C)N(C)C(=O)[C@H](CC(C)C)N(C)C(=O)[C@H](CC(C)C)N(C)C(=O)[C@@H](C)NC(=O)[C@H](C)NC(=O)[C@H](CC(C)C)N(C)C(=O)[C@@H](NC(=O)[C@@H](NC)[C@H](C)COCC(=O)N1CCNCC1)C(C)C)C(=O)N(C)[C@H](C)C(C)=O |r|
Show InChI InChI=1S/C69H125N13O14/c1-26-28-29-44(13)59(85)58(63(89)74-50(27-2)65(91)76(20)48(17)49(18)83)81(25)69(95)57(43(11)12)80(24)67(93)53(36-41(7)8)79(23)66(92)52(35-40(5)6)78(22)64(90)47(16)73-60(86)46(15)72-61(87)51(34-39(3)4)77(21)68(94)55(42(9)10)75-62(88)56(70-19)45(14)37-96-38-54(84)82-32-30-71-31-33-82/h26,28,39-48,50-53,55-59,70-71,85H,27,29-38H2,1-25H3,(H,72,87)(H,73,86)(H,74,89)(H,75,88)/b28-26+/t44-,45-,46+,47-,48-,50+,51+,52+,53+,55+,56+,57+,58+,59-/m1/s1
US Patent
n/an/an/a 0.400n/an/an/a7.4n/a
Novartis AG
US Patent
Assay Description
Binding of inhibitors to expressed cyclophilins was determined using surface plasmon resonance (SPR) experiments. Briefly, avi-tagged cyclophilin pro...
US Patent US9566312 (2017)
BindingDB Entry DOI: 10.7270/Q2K939J1
Peptidyl-prolyl cis-trans isomerase B
(Homo sapiens (Human))
BDBM286555
(US9566312, Compound 2.6.1)
Show SMILES CC[C@H](NC(=O)[C@H]([C@H](O)[C@H](C)C\C=C\C)N(C)C(=O)[C@H](C(C)C)N(C)C(=O)[C@H](CC(C)C)N(C)C(=O)[C@H](CC(C)C)N(C)C(=O)[C@@H](C)NC(=O)[C@H](C)NC(=O)[C@H](CC(C)C)N(C)C(=O)[C@@H](NC(=O)[C@@H](NC)[C@H](C)COCC(=O)N1CCNCC1)C(C)C)C(=O)N(C)[C@H](C)C(C)=O |r|
Show InChI InChI=1S/C69H125N13O14/c1-26-28-29-44(13)59(85)58(63(89)74-50(27-2)65(91)76(20)48(17)49(18)83)81(25)69(95)57(43(11)12)80(24)67(93)53(36-41(7)8)79(23)66(92)52(35-40(5)6)78(22)64(90)47(16)73-60(86)46(15)72-61(87)51(34-39(3)4)77(21)68(94)55(42(9)10)75-62(88)56(70-19)45(14)37-96-38-54(84)82-32-30-71-31-33-82/h26,28,39-48,50-53,55-59,70-71,85H,27,29-38H2,1-25H3,(H,72,87)(H,73,86)(H,74,89)(H,75,88)/b28-26+/t44-,45-,46+,47-,48-,50+,51+,52+,53+,55+,56+,57+,58+,59-/m1/s1
Reactome pathway
US Patent
n/an/an/a 0.700n/an/an/a7.4n/a
Novartis AG
US Patent
Assay Description
Binding of inhibitors to expressed cyclophilins was determined using surface plasmon resonance (SPR) experiments. Briefly, avi-tagged cyclophilin pro...
US Patent US9566312 (2017)
BindingDB Entry DOI: 10.7270/Q2K939J1