null
SMILES: CCCC[C@@H](C)[C@@H](O)[C@@H]1N(C)C(=O)[C@H](C(C)C)N(C)C(=O)[C@H](CC(C)C)N(C)C(=O)[C@H](CC(C)C)N(C)C(=O)[C@@H](C)NC(=O)[C@H](C)NC(=O)[C@H](CC(C)C)N(C)C(=O)[C@@H](NC(=O)[C@H]([C@@H](C)CN2CCOCC2)N(C)C(=O)[C@@H](C)N(C)C(=O)[C@H](CC)NC1=O)C(C)C
InChI Key: InChIKey=NUSCJPWYLQAJBN-RSFXBHFYSA-N
Activity Spreadsheet -- Enzyme Inhibition Constant Data from BindingDB
Found 3 hits for monomerid = 286589
Trg + Lig
Ki
nM
ΔG°
kcal/mole
IC50
nM
Kd
nM
EC50/IC50
nM
koff
s-1
kon
M-1s-1
pHTemp
°C
Peptidyl-prolyl cis-trans isomerase A
(Homo sapiens (Human))
BDBM286589
(US9566312, Compound 2.17.7)
Show SMILES CCCC[C@@H](C)[C@@H](O)[C@@H]1N(C)C(=O)[C@H](C(C)C)N(C)C(=O)[C@H](CC(C)C)N(C)C(=O)[C@H](CC(C)C)N(C)C(=O)[C@@H](C)NC(=O)[C@H](C)NC(=O)[C@H](CC(C)C)N(C)C(=O)[C@@H](NC(=O)[C@H]([C@@H](C)CN2CCOCC2)N(C)C(=O)[C@@H](C)N(C)C(=O)[C@H](CC)NC1=O)C(C)C |r|
Show InChI InChI=1S/C66H120N12O13/c1-25-27-28-42(13)55(79)54-59(83)69-47(26-2)62(86)71(18)46(17)61(85)76(23)53(43(14)36-78-29-31-91-32-30-78)58(82)70-51(40(9)10)65(89)72(19)48(33-37(3)4)57(81)67-44(15)56(80)68-45(16)60(84)73(20)49(34-38(5)6)63(87)74(21)50(35-39(7)8)64(88)75(22)52(41(11)12)66(90)77(54)24/h37-55,79H,25-36H2,1-24H3,(H,67,81)(H,68,80)(H,69,83)(H,70,82)/t42-,43+,44+,45-,46-,47+,48+,49+,50+,51+,52+,53+,54+,55-/m1/s1
Reactome pathway
US Patent
n/an/an/a 1.5n/an/an/a7.4n/a
Novartis AG
US Patent
Assay Description
Binding of inhibitors to expressed cyclophilins was determined using surface plasmon resonance (SPR) experiments. Briefly, avi-tagged cyclophilin pro...
US Patent US9566312 (2017)
BindingDB Entry DOI: 10.7270/Q2K939J1
Peptidyl-prolyl cis-trans isomerase F, mitochondrial
(Homo sapiens (Human))
BDBM286589
(US9566312, Compound 2.17.7)
Show SMILES CCCC[C@@H](C)[C@@H](O)[C@@H]1N(C)C(=O)[C@H](C(C)C)N(C)C(=O)[C@H](CC(C)C)N(C)C(=O)[C@H](CC(C)C)N(C)C(=O)[C@@H](C)NC(=O)[C@H](C)NC(=O)[C@H](CC(C)C)N(C)C(=O)[C@@H](NC(=O)[C@H]([C@@H](C)CN2CCOCC2)N(C)C(=O)[C@@H](C)N(C)C(=O)[C@H](CC)NC1=O)C(C)C |r|
Show InChI InChI=1S/C66H120N12O13/c1-25-27-28-42(13)55(79)54-59(83)69-47(26-2)62(86)71(18)46(17)61(85)76(23)53(43(14)36-78-29-31-91-32-30-78)58(82)70-51(40(9)10)65(89)72(19)48(33-37(3)4)57(81)67-44(15)56(80)68-45(16)60(84)73(20)49(34-38(5)6)63(87)74(21)50(35-39(7)8)64(88)75(22)52(41(11)12)66(90)77(54)24/h37-55,79H,25-36H2,1-24H3,(H,67,81)(H,68,80)(H,69,83)(H,70,82)/t42-,43+,44+,45-,46-,47+,48+,49+,50+,51+,52+,53+,54+,55-/m1/s1
US Patent
n/an/an/a 0.700n/an/an/a7.4n/a
Novartis AG
US Patent
Assay Description
Binding of inhibitors to expressed cyclophilins was determined using surface plasmon resonance (SPR) experiments. Briefly, avi-tagged cyclophilin pro...
US Patent US9566312 (2017)
BindingDB Entry DOI: 10.7270/Q2K939J1
Peptidyl-prolyl cis-trans isomerase B
(Homo sapiens (Human))
BDBM286589
(US9566312, Compound 2.17.7)
Show SMILES CCCC[C@@H](C)[C@@H](O)[C@@H]1N(C)C(=O)[C@H](C(C)C)N(C)C(=O)[C@H](CC(C)C)N(C)C(=O)[C@H](CC(C)C)N(C)C(=O)[C@@H](C)NC(=O)[C@H](C)NC(=O)[C@H](CC(C)C)N(C)C(=O)[C@@H](NC(=O)[C@H]([C@@H](C)CN2CCOCC2)N(C)C(=O)[C@@H](C)N(C)C(=O)[C@H](CC)NC1=O)C(C)C |r|
Show InChI InChI=1S/C66H120N12O13/c1-25-27-28-42(13)55(79)54-59(83)69-47(26-2)62(86)71(18)46(17)61(85)76(23)53(43(14)36-78-29-31-91-32-30-78)58(82)70-51(40(9)10)65(89)72(19)48(33-37(3)4)57(81)67-44(15)56(80)68-45(16)60(84)73(20)49(34-38(5)6)63(87)74(21)50(35-39(7)8)64(88)75(22)52(41(11)12)66(90)77(54)24/h37-55,79H,25-36H2,1-24H3,(H,67,81)(H,68,80)(H,69,83)(H,70,82)/t42-,43+,44+,45-,46-,47+,48+,49+,50+,51+,52+,53+,54+,55-/m1/s1
Reactome pathway
US Patent
n/an/an/a 0.700n/an/an/a7.4n/a
Novartis AG
US Patent
Assay Description
Binding of inhibitors to expressed cyclophilins was determined using surface plasmon resonance (SPR) experiments. Briefly, avi-tagged cyclophilin pro...
US Patent US9566312 (2017)
BindingDB Entry DOI: 10.7270/Q2K939J1