BDBM28685 5-methyl-2-({3-[(5-methyl-1H-indole-1-)sulfonyl]benzene}amido)benzoic acid::Anthranilic acid deriv., 23
SMILES: Cc1ccc(NC(=O)c2cccc(c2)S(=O)(=O)n2ccc3cc(C)ccc23)c(c1)C(O)=O
InChI Key: InChIKey=NLCREHFHCSVZKD-UHFFFAOYSA-N
Data: 6 IC50  1 EC50
Activity Spreadsheet -- Enzyme Inhibition Constant Data from BindingDB
Found 6 hits for monomerid = 28685
Trg + Lig
Ki
nM
ΔG°
kcal/mole
IC50
nM
Kd
nM
EC50/IC50
nM
koff
s-1
kon
M-1s-1
pHTemp
°C
Peroxisome proliferator-activated receptor delta
(Homo sapiens (Human))
BDBM28685
(5-methyl-2-({3-[(5-methyl-1H-indole-1-)sulfonyl]be...)
Show SMILES Cc1ccc(NC(=O)c2cccc(c2)S(=O)(=O)n2ccc3cc(C)ccc23)c(c1)C(O)=O
Show InChI InChI=1S/C24H20N2O5S/c1-15-7-9-22-17(12-15)10-11-26(22)32(30,31)19-5-3-4-18(14-19)23(27)25-21-8-6-16(2)13-20(21)24(28)29/h3-14H,1-2H3,(H,25,27)(H,28,29)
n/an/a 10n/a 32n/an/an/an/a
GSK
Assay Description
Competition-binding curves for test compounds were determined with expressed human PPAR LBD. Plots of inhibitor concentration versus cpm of radioliga...
Bioorg Med Chem Lett 18: 5018-22 (2008)
Article DOI: 10.1016/j.bmcl.2008.08.011
BindingDB Entry DOI: 10.7270/Q2WD3XWS
Peroxisome proliferator-activated receptor alpha (PPAR alpha)
(Homo sapiens (Human))
BDBM28685
(5-methyl-2-({3-[(5-methyl-1H-indole-1-)sulfonyl]be...)
Show SMILES Cc1ccc(NC(=O)c2cccc(c2)S(=O)(=O)n2ccc3cc(C)ccc23)c(c1)C(O)=O
Show InChI InChI=1S/C24H20N2O5S/c1-15-7-9-22-17(12-15)10-11-26(22)32(30,31)19-5-3-4-18(14-19)23(27)25-21-8-6-16(2)13-20(21)24(28)29/h3-14H,1-2H3,(H,25,27)(H,28,29)
n/an/a 1.00E+3n/an/an/an/an/an/a
GSK
Assay Description
Competition-binding curves for test compounds were determined with expressed human PPAR LBD. Plots of inhibitor concentration versus cpm of radioliga...
Bioorg Med Chem Lett 18: 5018-22 (2008)
Article DOI: 10.1016/j.bmcl.2008.08.011
BindingDB Entry DOI: 10.7270/Q2WD3XWS
Peroxisome proliferator-activated receptor
(Homo sapiens (Human))
BDBM28685
(5-methyl-2-({3-[(5-methyl-1H-indole-1-)sulfonyl]be...)
Show SMILES Cc1ccc(NC(=O)c2cccc(c2)S(=O)(=O)n2ccc3cc(C)ccc23)c(c1)C(O)=O
Show InChI InChI=1S/C24H20N2O5S/c1-15-7-9-22-17(12-15)10-11-26(22)32(30,31)19-5-3-4-18(14-19)23(27)25-21-8-6-16(2)13-20(21)24(28)29/h3-14H,1-2H3,(H,25,27)(H,28,29)
NCI pathway
Reactome pathway
n/an/a 2.51E+3n/an/an/an/an/an/a
Universidad Nacional Aut£noma de M£xico
Curated by ChEMBL
Assay Description
Agonist activity at PPARgamma
Bioorg Med Chem 20: 3523-32 (2012)
Article DOI: 10.1016/j.bmc.2012.04.005
BindingDB Entry DOI: 10.7270/Q2MP54B4
Peroxisome proliferator-activated receptor alpha (PPAR alpha)
(Homo sapiens (Human))
BDBM28685
(5-methyl-2-({3-[(5-methyl-1H-indole-1-)sulfonyl]be...)
Show SMILES Cc1ccc(NC(=O)c2cccc(c2)S(=O)(=O)n2ccc3cc(C)ccc23)c(c1)C(O)=O
Show InChI InChI=1S/C24H20N2O5S/c1-15-7-9-22-17(12-15)10-11-26(22)32(30,31)19-5-3-4-18(14-19)23(27)25-21-8-6-16(2)13-20(21)24(28)29/h3-14H,1-2H3,(H,25,27)(H,28,29)
n/an/a 1.00E+3n/an/an/an/an/an/a
Universidad Nacional Aut£noma de M£xico
Curated by ChEMBL
Assay Description
Agonist activity at PPARalpha
Bioorg Med Chem 20: 3523-32 (2012)
Article DOI: 10.1016/j.bmc.2012.04.005
BindingDB Entry DOI: 10.7270/Q2MP54B4
Peroxisome proliferator-activated receptor delta
(Homo sapiens (Human))
BDBM28685
(5-methyl-2-({3-[(5-methyl-1H-indole-1-)sulfonyl]be...)
Show SMILES Cc1ccc(NC(=O)c2cccc(c2)S(=O)(=O)n2ccc3cc(C)ccc23)c(c1)C(O)=O
Show InChI InChI=1S/C24H20N2O5S/c1-15-7-9-22-17(12-15)10-11-26(22)32(30,31)19-5-3-4-18(14-19)23(27)25-21-8-6-16(2)13-20(21)24(28)29/h3-14H,1-2H3,(H,25,27)(H,28,29)
n/an/a 10n/an/an/an/an/an/a
Universidad Nacional Aut£noma de M£xico
Curated by ChEMBL
Assay Description
Agonist activity at PPARdelta
Bioorg Med Chem 20: 3523-32 (2012)
Article DOI: 10.1016/j.bmc.2012.04.005
BindingDB Entry DOI: 10.7270/Q2MP54B4
Peroxisome proliferator-activated receptor
(Homo sapiens (Human))
BDBM28685
(5-methyl-2-({3-[(5-methyl-1H-indole-1-)sulfonyl]be...)
Show SMILES Cc1ccc(NC(=O)c2cccc(c2)S(=O)(=O)n2ccc3cc(C)ccc23)c(c1)C(O)=O
Show InChI InChI=1S/C24H20N2O5S/c1-15-7-9-22-17(12-15)10-11-26(22)32(30,31)19-5-3-4-18(14-19)23(27)25-21-8-6-16(2)13-20(21)24(28)29/h3-14H,1-2H3,(H,25,27)(H,28,29)
NCI pathway
Reactome pathway
n/an/a 2.51E+3n/an/an/an/an/an/a
GSK
Assay Description
Competition-binding curves for test compounds were determined with expressed human PPAR LBD. Plots of inhibitor concentration versus cpm of radioliga...
Bioorg Med Chem Lett 18: 5018-22 (2008)
Article DOI: 10.1016/j.bmcl.2008.08.011
BindingDB Entry DOI: 10.7270/Q2WD3XWS