BDBM28690 2-({3-[(6-methoxy-1H-indole-1-)sulfonyl]benzene}amido)-5-methylbenzoic acid::Anthranilic acid deriv., 28
SMILES: COc1ccc2ccn(c2c1)S(=O)(=O)c1cccc(c1)C(=O)Nc1ccc(C)cc1C(O)=O
InChI Key: InChIKey=JRLWCVYDISBEGH-UHFFFAOYSA-N
Data: 6 IC50  1 EC50
Activity Spreadsheet -- Enzyme Inhibition Constant Data from BindingDB
Found 6 hits for monomerid = 28690
Trg + Lig
Ki
nM
ΔG°
kcal/mole
IC50
nM
Kd
nM
EC50/IC50
nM
koff
s-1
kon
M-1s-1
pHTemp
°C
Peroxisome proliferator-activated receptor delta
(Homo sapiens (Human))
BDBM28690
(2-({3-[(6-methoxy-1H-indole-1-)sulfonyl]benzene}am...)
Show SMILES COc1ccc2ccn(c2c1)S(=O)(=O)c1cccc(c1)C(=O)Nc1ccc(C)cc1C(O)=O
Show InChI InChI=1S/C24H20N2O6S/c1-15-6-9-21(20(12-15)24(28)29)25-23(27)17-4-3-5-19(13-17)33(30,31)26-11-10-16-7-8-18(32-2)14-22(16)26/h3-14H,1-2H3,(H,25,27)(H,28,29)
n/an/a 32n/a 100n/an/an/an/a
GSK
Assay Description
Competition-binding curves for test compounds were determined with expressed human PPAR LBD. Plots of inhibitor concentration versus cpm of radioliga...
Bioorg Med Chem Lett 18: 5018-22 (2008)
Article DOI: 10.1016/j.bmcl.2008.08.011
BindingDB Entry DOI: 10.7270/Q2WD3XWS
Peroxisome proliferator-activated receptor alpha (PPAR alpha)
(Homo sapiens (Human))
BDBM28690
(2-({3-[(6-methoxy-1H-indole-1-)sulfonyl]benzene}am...)
Show SMILES COc1ccc2ccn(c2c1)S(=O)(=O)c1cccc(c1)C(=O)Nc1ccc(C)cc1C(O)=O
Show InChI InChI=1S/C24H20N2O6S/c1-15-6-9-21(20(12-15)24(28)29)25-23(27)17-4-3-5-19(13-17)33(30,31)26-11-10-16-7-8-18(32-2)14-22(16)26/h3-14H,1-2H3,(H,25,27)(H,28,29)
n/an/a 3.98E+3n/an/an/an/an/an/a
GSK
Assay Description
Competition-binding curves for test compounds were determined with expressed human PPAR LBD. Plots of inhibitor concentration versus cpm of radioliga...
Bioorg Med Chem Lett 18: 5018-22 (2008)
Article DOI: 10.1016/j.bmcl.2008.08.011
BindingDB Entry DOI: 10.7270/Q2WD3XWS
Peroxisome proliferator-activated receptor delta
(Homo sapiens (Human))
BDBM28690
(2-({3-[(6-methoxy-1H-indole-1-)sulfonyl]benzene}am...)
Show SMILES COc1ccc2ccn(c2c1)S(=O)(=O)c1cccc(c1)C(=O)Nc1ccc(C)cc1C(O)=O
Show InChI InChI=1S/C24H20N2O6S/c1-15-6-9-21(20(12-15)24(28)29)25-23(27)17-4-3-5-19(13-17)33(30,31)26-11-10-16-7-8-18(32-2)14-22(16)26/h3-14H,1-2H3,(H,25,27)(H,28,29)
n/an/a 32.0n/an/an/an/an/an/a
Universidad Nacional Aut£noma de M£xico
Curated by ChEMBL
Assay Description
Agonist activity at PPARdelta
Bioorg Med Chem 20: 3523-32 (2012)
Article DOI: 10.1016/j.bmc.2012.04.005
BindingDB Entry DOI: 10.7270/Q2MP54B4
Peroxisome proliferator-activated receptor alpha (PPAR alpha)
(Homo sapiens (Human))
BDBM28690
(2-({3-[(6-methoxy-1H-indole-1-)sulfonyl]benzene}am...)
Show SMILES COc1ccc2ccn(c2c1)S(=O)(=O)c1cccc(c1)C(=O)Nc1ccc(C)cc1C(O)=O
Show InChI InChI=1S/C24H20N2O6S/c1-15-6-9-21(20(12-15)24(28)29)25-23(27)17-4-3-5-19(13-17)33(30,31)26-11-10-16-7-8-18(32-2)14-22(16)26/h3-14H,1-2H3,(H,25,27)(H,28,29)
n/an/a 3.98E+3n/an/an/an/an/an/a
Universidad Nacional Aut£noma de M£xico
Curated by ChEMBL
Assay Description
Agonist activity at PPARalpha
Bioorg Med Chem 20: 3523-32 (2012)
Article DOI: 10.1016/j.bmc.2012.04.005
BindingDB Entry DOI: 10.7270/Q2MP54B4
Peroxisome proliferator-activated receptor
(Homo sapiens (Human))
BDBM28690
(2-({3-[(6-methoxy-1H-indole-1-)sulfonyl]benzene}am...)
Show SMILES COc1ccc2ccn(c2c1)S(=O)(=O)c1cccc(c1)C(=O)Nc1ccc(C)cc1C(O)=O
Show InChI InChI=1S/C24H20N2O6S/c1-15-6-9-21(20(12-15)24(28)29)25-23(27)17-4-3-5-19(13-17)33(30,31)26-11-10-16-7-8-18(32-2)14-22(16)26/h3-14H,1-2H3,(H,25,27)(H,28,29)
NCI pathway
Reactome pathway
n/an/a 7.94E+3n/an/an/an/an/an/a
Universidad Nacional Aut£noma de M£xico
Curated by ChEMBL
Assay Description
Agonist activity at PPARgamma
Bioorg Med Chem 20: 3523-32 (2012)
Article DOI: 10.1016/j.bmc.2012.04.005
BindingDB Entry DOI: 10.7270/Q2MP54B4
Peroxisome proliferator-activated receptor
(Homo sapiens (Human))
BDBM28690
(2-({3-[(6-methoxy-1H-indole-1-)sulfonyl]benzene}am...)
Show SMILES COc1ccc2ccn(c2c1)S(=O)(=O)c1cccc(c1)C(=O)Nc1ccc(C)cc1C(O)=O
Show InChI InChI=1S/C24H20N2O6S/c1-15-6-9-21(20(12-15)24(28)29)25-23(27)17-4-3-5-19(13-17)33(30,31)26-11-10-16-7-8-18(32-2)14-22(16)26/h3-14H,1-2H3,(H,25,27)(H,28,29)
NCI pathway
Reactome pathway
n/an/a 7.94E+3n/an/an/an/an/an/a
GSK
Assay Description
Competition-binding curves for test compounds were determined with expressed human PPAR LBD. Plots of inhibitor concentration versus cpm of radioliga...
Bioorg Med Chem Lett 18: 5018-22 (2008)
Article DOI: 10.1016/j.bmcl.2008.08.011
BindingDB Entry DOI: 10.7270/Q2WD3XWS