BDBM28698 5-chloro-2-({3-[(5-methoxy-4-methyl-1H-indole-1-)sulfonyl]benzene}amido)benzoic acid::Anthranilic acid deriv., 36
SMILES: COc1ccc2n(ccc2c1C)S(=O)(=O)c1cccc(c1)C(=O)Nc1ccc(Cl)cc1C(O)=O
InChI Key: InChIKey=RSMCCEMRGNFJPV-UHFFFAOYSA-N
Data: 6 IC50  1 EC50
Activity Spreadsheet -- Enzyme Inhibition Constant Data from BindingDB
Found 6 hits for monomerid = 28698
Trg + Lig
Ki
nM
ΔG°
kcal/mole
IC50
nM
Kd
nM
EC50/IC50
nM
koff
s-1
kon
M-1s-1
pHTemp
°C
Peroxisome proliferator-activated receptor delta
(Homo sapiens (Human))
BDBM28698
(5-chloro-2-({3-[(5-methoxy-4-methyl-1H-indole-1-)s...)
Show SMILES COc1ccc2n(ccc2c1C)S(=O)(=O)c1cccc(c1)C(=O)Nc1ccc(Cl)cc1C(O)=O
Show InChI InChI=1S/C24H19ClN2O6S/c1-14-18-10-11-27(21(18)8-9-22(14)33-2)34(31,32)17-5-3-4-15(12-17)23(28)26-20-7-6-16(25)13-19(20)24(29)30/h3-13H,1-2H3,(H,26,28)(H,29,30)
n/an/a 16n/a 16n/an/an/an/a
GSK
Assay Description
Competition-binding curves for test compounds were determined with expressed human PPAR LBD. Plots of inhibitor concentration versus cpm of radioliga...
Bioorg Med Chem Lett 18: 5018-22 (2008)
Article DOI: 10.1016/j.bmcl.2008.08.011
BindingDB Entry DOI: 10.7270/Q2WD3XWS
Peroxisome proliferator-activated receptor alpha (PPAR alpha)
(Homo sapiens (Human))
BDBM28698
(5-chloro-2-({3-[(5-methoxy-4-methyl-1H-indole-1-)s...)
Show SMILES COc1ccc2n(ccc2c1C)S(=O)(=O)c1cccc(c1)C(=O)Nc1ccc(Cl)cc1C(O)=O
Show InChI InChI=1S/C24H19ClN2O6S/c1-14-18-10-11-27(21(18)8-9-22(14)33-2)34(31,32)17-5-3-4-15(12-17)23(28)26-20-7-6-16(25)13-19(20)24(29)30/h3-13H,1-2H3,(H,26,28)(H,29,30)
n/an/a 3.16E+3n/an/an/an/an/an/a
GSK
Assay Description
Competition-binding curves for test compounds were determined with expressed human PPAR LBD. Plots of inhibitor concentration versus cpm of radioliga...
Bioorg Med Chem Lett 18: 5018-22 (2008)
Article DOI: 10.1016/j.bmcl.2008.08.011
BindingDB Entry DOI: 10.7270/Q2WD3XWS
Peroxisome proliferator-activated receptor alpha (PPAR alpha)
(Homo sapiens (Human))
BDBM28698
(5-chloro-2-({3-[(5-methoxy-4-methyl-1H-indole-1-)s...)
Show SMILES COc1ccc2n(ccc2c1C)S(=O)(=O)c1cccc(c1)C(=O)Nc1ccc(Cl)cc1C(O)=O
Show InChI InChI=1S/C24H19ClN2O6S/c1-14-18-10-11-27(21(18)8-9-22(14)33-2)34(31,32)17-5-3-4-15(12-17)23(28)26-20-7-6-16(25)13-19(20)24(29)30/h3-13H,1-2H3,(H,26,28)(H,29,30)
n/an/a 3.16E+3n/an/an/an/an/an/a
Universidad Nacional Aut£noma de M£xico
Curated by ChEMBL
Assay Description
Agonist activity at PPARalpha
Bioorg Med Chem 20: 3523-32 (2012)
Article DOI: 10.1016/j.bmc.2012.04.005
BindingDB Entry DOI: 10.7270/Q2MP54B4
Peroxisome proliferator-activated receptor delta
(Homo sapiens (Human))
BDBM28698
(5-chloro-2-({3-[(5-methoxy-4-methyl-1H-indole-1-)s...)
Show SMILES COc1ccc2n(ccc2c1C)S(=O)(=O)c1cccc(c1)C(=O)Nc1ccc(Cl)cc1C(O)=O
Show InChI InChI=1S/C24H19ClN2O6S/c1-14-18-10-11-27(21(18)8-9-22(14)33-2)34(31,32)17-5-3-4-15(12-17)23(28)26-20-7-6-16(25)13-19(20)24(29)30/h3-13H,1-2H3,(H,26,28)(H,29,30)
n/an/a 16n/an/an/an/an/an/a
Universidad Nacional Aut£noma de M£xico
Curated by ChEMBL
Assay Description
Agonist activity at PPARdelta
Bioorg Med Chem 20: 3523-32 (2012)
Article DOI: 10.1016/j.bmc.2012.04.005
BindingDB Entry DOI: 10.7270/Q2MP54B4
Peroxisome proliferator-activated receptor
(Homo sapiens (Human))
BDBM28698
(5-chloro-2-({3-[(5-methoxy-4-methyl-1H-indole-1-)s...)
Show SMILES COc1ccc2n(ccc2c1C)S(=O)(=O)c1cccc(c1)C(=O)Nc1ccc(Cl)cc1C(O)=O
Show InChI InChI=1S/C24H19ClN2O6S/c1-14-18-10-11-27(21(18)8-9-22(14)33-2)34(31,32)17-5-3-4-15(12-17)23(28)26-20-7-6-16(25)13-19(20)24(29)30/h3-13H,1-2H3,(H,26,28)(H,29,30)
NCI pathway
Reactome pathway
n/an/a 3.16E+3n/an/an/an/an/an/a
Universidad Nacional Aut£noma de M£xico
Curated by ChEMBL
Assay Description
Agonist activity at PPARgamma
Bioorg Med Chem 20: 3523-32 (2012)
Article DOI: 10.1016/j.bmc.2012.04.005
BindingDB Entry DOI: 10.7270/Q2MP54B4
Peroxisome proliferator-activated receptor
(Homo sapiens (Human))
BDBM28698
(5-chloro-2-({3-[(5-methoxy-4-methyl-1H-indole-1-)s...)
Show SMILES COc1ccc2n(ccc2c1C)S(=O)(=O)c1cccc(c1)C(=O)Nc1ccc(Cl)cc1C(O)=O
Show InChI InChI=1S/C24H19ClN2O6S/c1-14-18-10-11-27(21(18)8-9-22(14)33-2)34(31,32)17-5-3-4-15(12-17)23(28)26-20-7-6-16(25)13-19(20)24(29)30/h3-13H,1-2H3,(H,26,28)(H,29,30)
NCI pathway
Reactome pathway
n/an/a 3.16E+3n/an/an/an/an/an/a
GSK
Assay Description
Competition-binding curves for test compounds were determined with expressed human PPAR LBD. Plots of inhibitor concentration versus cpm of radioliga...
Bioorg Med Chem Lett 18: 5018-22 (2008)
Article DOI: 10.1016/j.bmcl.2008.08.011
BindingDB Entry DOI: 10.7270/Q2WD3XWS