BDBM28772 2-[3-(4-{[2-(2,4-dichlorophenoxy)ethyl]carbamoyl}-5-(propan-2-yl)-1,2-oxazol-3-yl)phenyl]acetic acid::trisubstituted isoxazole, 17g
SMILES: CC(C)c1onc(c1C(=O)NCCOc1ccc(Cl)cc1Cl)-c1cccc(CC(O)=O)c1
InChI Key: InChIKey=VGDVHUHMEGINCY-UHFFFAOYSA-N
Data: 3 EC50
Activity Spreadsheet -- Enzyme Inhibition Constant Data from BindingDB
Found 3 hits for monomerid = 28772
Trg + Lig
Ki
nM
ΔG°
kcal/mole
IC50
nM
Kd
nM
EC50/IC50
nM
koff
s-1
kon
M-1s-1
pHTemp
°C
Peroxisome proliferator-activated receptor delta
(Homo sapiens (Human))
BDBM28772
(2-[3-(4-{[2-(2,4-dichlorophenoxy)ethyl]carbamoyl}-...)
Show SMILES CC(C)c1onc(c1C(=O)NCCOc1ccc(Cl)cc1Cl)-c1cccc(CC(O)=O)c1
Show InChI InChI=1S/C23H22Cl2N2O5/c1-13(2)22-20(21(27-32-22)15-5-3-4-14(10-15)11-19(28)29)23(30)26-8-9-31-18-7-6-16(24)12-17(18)25/h3-7,10,12-13H,8-9,11H2,1-2H3,(H,26,30)(H,28,29)
n/an/an/an/a 1.07E+3n/an/an/an/a
GNF
Assay Description
EC50 is the concentration of test compounds needed to induce 50% of the maximum luciferase activity in HEK cells transfected with PPAR and Gal4-lucif...
Bioorg Med Chem Lett 16: 5488-92 (2006)
Article DOI: 10.1016/j.bmcl.2006.08.052
BindingDB Entry DOI: 10.7270/Q23X84Z3
Peroxisome proliferator-activated receptor
(Homo sapiens (Human))
BDBM28772
(2-[3-(4-{[2-(2,4-dichlorophenoxy)ethyl]carbamoyl}-...)
Show SMILES CC(C)c1onc(c1C(=O)NCCOc1ccc(Cl)cc1Cl)-c1cccc(CC(O)=O)c1
Show InChI InChI=1S/C23H22Cl2N2O5/c1-13(2)22-20(21(27-32-22)15-5-3-4-14(10-15)11-19(28)29)23(30)26-8-9-31-18-7-6-16(24)12-17(18)25/h3-7,10,12-13H,8-9,11H2,1-2H3,(H,26,30)(H,28,29)
NCI pathway
Reactome pathway
n/an/an/an/a>1.00E+4n/an/an/an/a
GNF
Assay Description
EC50 is the concentration of test compounds needed to induce 50% of the maximum luciferase activity in HEK cells transfected with PPAR and Gal4-lucif...
Bioorg Med Chem Lett 16: 5488-92 (2006)
Article DOI: 10.1016/j.bmcl.2006.08.052
BindingDB Entry DOI: 10.7270/Q23X84Z3
Peroxisome proliferator-activated receptor alpha (PPAR alpha)
(Homo sapiens (Human))
BDBM28772
(2-[3-(4-{[2-(2,4-dichlorophenoxy)ethyl]carbamoyl}-...)
Show SMILES CC(C)c1onc(c1C(=O)NCCOc1ccc(Cl)cc1Cl)-c1cccc(CC(O)=O)c1
Show InChI InChI=1S/C23H22Cl2N2O5/c1-13(2)22-20(21(27-32-22)15-5-3-4-14(10-15)11-19(28)29)23(30)26-8-9-31-18-7-6-16(24)12-17(18)25/h3-7,10,12-13H,8-9,11H2,1-2H3,(H,26,30)(H,28,29)
n/an/an/an/a>1.00E+4n/an/an/an/a
GNF
Assay Description
EC50 is the concentration of test compounds needed to induce 50% of the maximum luciferase activity in HEK cells transfected with PPAR and Gal4-lucif...
Bioorg Med Chem Lett 16: 5488-92 (2006)
Article DOI: 10.1016/j.bmcl.2006.08.052
BindingDB Entry DOI: 10.7270/Q23X84Z3