BDBM287884 8-(1-methyl-1H-pyrazol-5- yl)-6-(6,7,8,9-tetrahydro- 5H-benzo[7]annulen-7- ylcarbonyl)-6,11-dihydro- 5H-pyrido[2,3-b] [1,5]benzodiazepine::US10086000, Example 101::US10508108, Example 101
SMILES: Cn1nccc1-c1ccc2Nc3ncccc3CN(C(=O)C3CCc4ccccc4CC3)c2c1
InChI Key: InChIKey=UGPNXLIHHNDMRR-UHFFFAOYSA-N
Data: 2 IC50
Activity Spreadsheet -- Enzyme Inhibition Constant Data from BindingDB
Found 2 hits for monomerid = 287884
Trg + Lig
Ki
nM
ΔG°
kcal/mole
IC50
nM
Kd
nM
EC50/IC50
nM
koff
s-1
kon
M-1s-1
pHTemp
°C
IDH1 R132H
(Homo sapiens (Human))
BDBM287884
(8-(1-methyl-1H-pyrazol-5- yl)-6-(6,7,8,9-tetrahydr...)
Show SMILES Cn1nccc1-c1ccc2Nc3ncccc3CN(C(=O)C3CCc4ccccc4CC3)c2c1
Show InChI InChI=1S/C28H27N5O/c1-32-25(14-16-30-32)22-12-13-24-26(17-22)33(18-23-7-4-15-29-27(23)31-24)28(34)21-10-8-19-5-2-3-6-20(19)9-11-21/h2-7,12-17,21H,8-11,18H2,1H3,(H,29,31)
US Patent
n/an/a 5n/an/an/an/an/an/a
Merck Sharp & Dohme Corp.
US Patent
Assay Description
Each test compound (10 mM stock in DMSO) is diluted in DMSO to make a 10-point, 3-fold dilution series. 125 nL of each dilution or DMSO alone is disp...
US Patent US10508108 (2019)
BindingDB Entry DOI: 10.7270/Q2N018X9
IDH1 R132H
(Homo sapiens (Human))
BDBM287884
(8-(1-methyl-1H-pyrazol-5- yl)-6-(6,7,8,9-tetrahydr...)
Show SMILES Cn1nccc1-c1ccc2Nc3ncccc3CN(C(=O)C3CCc4ccccc4CC3)c2c1
Show InChI InChI=1S/C28H27N5O/c1-32-25(14-16-30-32)22-12-13-24-26(17-22)33(18-23-7-4-15-29-27(23)31-24)28(34)21-10-8-19-5-2-3-6-20(19)9-11-21/h2-7,12-17,21H,8-11,18H2,1H3,(H,29,31)
US Patent
n/an/a 5n/an/an/an/a7.025
Merck Sharp & Dohme Corp.
US Patent
Assay Description
Each test compound (10 mM stock in DMSO) is diluted in DMSO to make a 10-point, 3-fold dilution series. 125 nL of each dilution or DMSO alone is disp...
US Patent US10086000 (2018)
BindingDB Entry DOI: 10.7270/Q2N58PCG