BDBM287955 N-(4-(4-((2-(4-methylpiperazin-1-yl)-2- phenylethyl)amino)quinazolin-2- yl)phenyl)methanesulfonamide::US10087148, Example 23
SMILES: CN1CCN(CC1)C(CNc1nc(nc2ccccc12)-c1ccc(NS(C)(=O)=O)cc1)c1ccccc1
InChI Key: InChIKey=VHRIHFKRNILXQE-UHFFFAOYSA-N
Data: 1 EC50
Activity Spreadsheet -- Enzyme Inhibition Constant Data from BindingDB
Found 1 hit for monomerid = 287955
Trg + Lig
Ki
nM
ΔG°
kcal/mole
IC50
nM
Kd
nM
EC50/IC50
nM
koff
s-1
kon
M-1s-1
pHTemp
°C
Sodium-dependent dopamine transporter
(Homo sapiens (Human))
BDBM287955
(N-(4-(4-((2-(4-methylpiperazin-1-yl)-2- phenylethy...)
Show SMILES CN1CCN(CC1)C(CNc1nc(nc2ccccc12)-c1ccc(NS(C)(=O)=O)cc1)c1ccccc1
Show InChI InChI=1S/C28H32N6O2S/c1-33-16-18-34(19-17-33)26(21-8-4-3-5-9-21)20-29-28-24-10-6-7-11-25(24)30-27(31-28)22-12-14-23(15-13-22)32-37(2,35)36/h3-15,26,32H,16-20H2,1-2H3,(H,29,30,31)
NCI pathway
Reactome pathway
US Patent
n/an/an/an/a 62n/an/a7.4n/a
THE UNITED STATES OF AMERICA AS REPRESENTED BY THE SECRETARY, DEPARTMENT OF HEALTH AND HUMAN SERVICES OFFICE OF TECHNOLOGY TRANSFER, NATIONAL INSTITUTE OF HEALTH; SOUTHERN RESEARCH INSTITUTE
US Patent
Assay Description
Uptake inhibition assay for the dopamine transporter was conducted in rat brain synaptosomes as described elsewhere with minor modifications (Rothman...
US Patent US10087148 (2018)
BindingDB Entry DOI: 10.7270/Q27W6F63