BDBM288024 US10087178, Example 6
SMILES: CCN1C(=O)c2c(O)c(=O)c(cn2C[C@]11C[C@@H](C1)OC)C(=O)NCc1cccc(Cl)c1F
InChI Key: InChIKey=HSYBXUBSTDDMPN-NHPVSCMHSA-N
Data: 1 EC50
Activity Spreadsheet -- Enzyme Inhibition Constant Data from BindingDB
Found 1 hit for monomerid = 288024
Trg + Lig
Ki
nM
ΔG°
kcal/mole
IC50
nM
Kd
nM
EC50/IC50
nM
koff
s-1
kon
M-1s-1
pHTemp
°C
Protein Nef
(Human immunodeficiency virus type 1 (isolate BRU/L...)
BDBM288024
(US10087178, Example 6)
Show SMILES CCN1C(=O)c2c(O)c(=O)c(cn2C[C@]11C[C@@H](C1)OC)C(=O)NCc1cccc(Cl)c1F |r,wU:16.20,wD:14.19,(8,2.24,;6.67,3.01,;5.33,2.24,;4,3.01,;4,4.55,;2.67,2.24,;1.33,3.01,;1.33,4.55,;,2.24,;-1.33,3.01,;,.7,;1.33,-.07,;2.67,.7,;4,-.07,;5.33,.7,;5.81,-.76,;7.34,-.92,;6.87,.54,;8.54,-1.89,;8.3,-3.41,;-1.33,-.07,;-1.33,-1.61,;-2.67,.7,;-4,-.07,;-5.33,.7,;-5.33,2.24,;-6.67,3.01,;-8,2.24,;-8,.7,;-9.34,-.07,;-6.67,-.07,;-6.67,-1.61,)|
Show InChI InChI=1S/C22H23ClFN3O5/c1-3-27-21(31)17-19(29)18(28)14(10-26(17)11-22(27)7-13(8-22)32-2)20(30)25-9-12-5-4-6-15(23)16(12)24/h4-6,10,13,29H,3,7-9,11H2,1-2H3,(H,25,30)/t13-,22+
US Patent
n/an/an/an/a 2n/an/an/a25
JAPAN TOBACCO INC.
US Patent
Assay Description
The medium (40 μL), a test substance (10 μL) diluted with the medium, and a 1×105 cells/mL MT-4 cell suspension (50 μL) wherein HIV-1 ...
US Patent US10087178 (2018)
BindingDB Entry DOI: 10.7270/Q20C4XSD