BDBM288049 US10087178, Example S9::trans-3-(benzyloxy)-N-(2,4- difluorobenzyl)-9'-hydroxy- 2'-methyl-1',8'-dioxo- 1',2',3',8'- tetrahydrospiro[cyclobutane- 1,4'-pyrido[1,2-a]pyrazine]- 7'-carboxamide hydrochloride
SMILES: CN1C[C@@]2(C[C@@H](C2)OCc2ccccc2)n2cc(C(=O)NCc3ccc(F)cc3F)c(=O)c(O)c2C1=O
InChI Key: InChIKey=OEWITROYXMAURT-GEQDBVPJSA-N
Data: 1 EC50
Activity Spreadsheet -- Enzyme Inhibition Constant Data from BindingDB
Found 1 hit for monomerid = 288049
Trg + Lig
Ki
nM
ΔG°
kcal/mole
IC50
nM
Kd
nM
EC50/IC50
nM
koff
s-1
kon
M-1s-1
pHTemp
°C
Protein Nef
(Human immunodeficiency virus type 1 (isolate BRU/L...)
BDBM288049
(US10087178, Example S9 | trans-3-(benzyloxy)-N-(2,...)
Show SMILES CN1C[C@@]2(C[C@@H](C2)OCc2ccccc2)n2cc(C(=O)NCc3ccc(F)cc3F)c(=O)c(O)c2C1=O |r,wU:3.3,5.7,(6.67,3.01,;5.33,2.24,;5.33,.7,;4,-.07,;2.91,-1.15,;4,-2.24,;5.09,-1.15,;4,-3.78,;5.33,-4.55,;6.67,-3.78,;8,-4.55,;9.34,-3.78,;9.34,-2.24,;8,-1.47,;6.67,-2.24,;2.67,.7,;1.33,-.07,;,.7,;-1.33,-.07,;-1.33,-1.61,;-2.67,.7,;-4,-.07,;-5.33,.7,;-5.33,2.24,;-6.67,3.01,;-8,2.24,;-9.34,3.01,;-8,.7,;-6.67,-.07,;-6.67,-1.61,;,2.24,;-1.33,3.01,;1.33,3.01,;1.33,4.55,;2.67,2.24,;4,3.01,;4,4.55,)|
Show InChI InChI=1S/C27H25F2N3O5/c1-31-15-27(10-19(11-27)37-14-16-5-3-2-4-6-16)32-13-20(23(33)24(34)22(32)26(31)36)25(35)30-12-17-7-8-18(28)9-21(17)29/h2-9,13,19,34H,10-12,14-15H2,1H3,(H,30,35)/t19-,27-
US Patent
n/an/an/an/a 5.20n/an/an/a25
JAPAN TOBACCO INC.
US Patent
Assay Description
The medium (40 μL), a test substance (10 μL) diluted with the medium, and a 1×105 cells/mL MT-4 cell suspension (50 μL) wherein HIV-1 ...
US Patent US10087178 (2018)
BindingDB Entry DOI: 10.7270/Q20C4XSD