null
SMILES: CC(C)c1cc2ccc(c(-c3cc(Cl)c4[nH]ncc4c3)n2n1)C(F)(F)F
InChI Key: InChIKey=ONCMLRPNKIQCQP-UHFFFAOYSA-N
Activity Spreadsheet -- Enzyme Inhibition Constant Data from BindingDB
Found 1 hit for monomerid = 288255
Trg + Lig
Ki
nM
ΔG°
kcal/mole
IC50
nM
Kd
nM
EC50/IC50
nM
koff
s-1
kon
M-1s-1
pHTemp
°C
Voltage-dependent calcium channel gamma-8 subunit
(Homo sapiens (Human))
BDBM288255
(7-Chloro-5-(2-isopropyl-6-(trifluoromethyl)pyrazol...)
Show SMILES CC(C)c1cc2ccc(c(-c3cc(Cl)c4[nH]ncc4c3)n2n1)C(F)(F)F
Show InChI InChI=1S/C18H14ClF3N4/c1-9(2)15-7-12-3-4-13(18(20,21)22)17(26(12)25-15)10-5-11-8-23-24-16(11)14(19)6-10/h3-9H,1-2H3,(H,23,24)
US Patent
n/an/a 0.0100n/an/an/an/a7.4n/a
Janssen Pharmaceutica NV
US Patent
Assay Description
This assay was used to test compounds for their ability to inhibit TARP γ8 dependent AMPA receptor activity. The AMPA receptor is a non-selectiv...
US Patent US10087185 (2018)
BindingDB Entry DOI: 10.7270/Q2QZ2D0H