BDBM288308 US10087188, Example 1::US10087188, Example 6
SMILES: Nc1nccn2c(nc(-c3ccc(cc3)C(=O)Nc3cc(ccn3)C(F)(F)F)c12)[C@@H]1CCC[C@@H](C1)C(O)=O
InChI Key: InChIKey=RXTBDWMAPHSRCE-SJORKVTESA-N
Data: 7 IC50
Activity Spreadsheet -- Enzyme Inhibition Constant Data from BindingDB
Found 7 hits for monomerid = 288308
Trg + Lig
Ki
nM
ΔG°
kcal/mole
IC50
nM
Kd
nM
EC50/IC50
nM
koff
s-1
kon
M-1s-1
pHTemp
°C
Tyrosine-protein kinase BTK
(Homo sapiens (Human))
BDBM288308
(US10087188, Example 1 | US10087188, Example 6)
Show SMILES Nc1nccn2c(nc(-c3ccc(cc3)C(=O)Nc3cc(ccn3)C(F)(F)F)c12)[C@@H]1CCC[C@@H](C1)C(O)=O |r|
Show InChI InChI=1S/C26H23F3N6O3/c27-26(28,29)18-8-9-31-19(13-18)33-24(36)15-6-4-14(5-7-15)20-21-22(30)32-10-11-35(21)23(34-20)16-2-1-3-17(12-16)25(37)38/h4-11,13,16-17H,1-3,12H2,(H2,30,32)(H,37,38)(H,31,33,36)/t16-,17+/m1/s1
NCI pathway
Reactome pathway
US Patent
n/an/a 0.510n/an/an/an/an/an/a
Merck Sharp & Dohme Corp.
US Patent
Assay Description
BTK enzymatic activity was determined with the LANCE (Lanthanide Chelate Excite) TR-FRET (Time-resolved fluorescence resonance energy transfer) assay...
US Patent US10087188 (2018)
BindingDB Entry DOI: 10.7270/Q2GF0WJC
Tyrosine-protein kinase BTK
(Homo sapiens (Human))
BDBM288308
(US10087188, Example 1 | US10087188, Example 6)
Show SMILES Nc1nccn2c(nc(-c3ccc(cc3)C(=O)Nc3cc(ccn3)C(F)(F)F)c12)[C@@H]1CCC[C@@H](C1)C(O)=O |r|
Show InChI InChI=1S/C26H23F3N6O3/c27-26(28,29)18-8-9-31-19(13-18)33-24(36)15-6-4-14(5-7-15)20-21-22(30)32-10-11-35(21)23(34-20)16-2-1-3-17(12-16)25(37)38/h4-11,13,16-17H,1-3,12H2,(H2,30,32)(H,37,38)(H,31,33,36)/t16-,17+/m1/s1
NCI pathway
Reactome pathway
US Patent
n/an/a 7.20n/an/an/an/an/an/a
Merck Sharp & Dohme Corp.
US Patent
Assay Description
BTK enzymatic activity was determined with the LANCE (Lanthanide Chelate Excite) TR-FRET (Time-resolved fluorescence resonance energy transfer) assay...
US Patent US10087188 (2018)
BindingDB Entry DOI: 10.7270/Q2GF0WJC
Tyrosine-protein kinase BTK
(Homo sapiens (Human))
BDBM288308
(US10087188, Example 1 | US10087188, Example 6)
Show SMILES Nc1nccn2c(nc(-c3ccc(cc3)C(=O)Nc3cc(ccn3)C(F)(F)F)c12)[C@@H]1CCC[C@@H](C1)C(O)=O |r|
Show InChI InChI=1S/C26H23F3N6O3/c27-26(28,29)18-8-9-31-19(13-18)33-24(36)15-6-4-14(5-7-15)20-21-22(30)32-10-11-35(21)23(34-20)16-2-1-3-17(12-16)25(37)38/h4-11,13,16-17H,1-3,12H2,(H2,30,32)(H,37,38)(H,31,33,36)/t16-,17+/m1/s1
NCI pathway
Reactome pathway
n/an/a 98n/an/an/an/an/an/a
Merck & Co Inc
Curated by ChEMBL
Assay Description
Inhibition of BTK in human PBMC
Bioorg Med Chem Lett 27: 1471-1477 (2017)
BindingDB Entry DOI: 10.7270/Q20867K5
Tyrosine-protein kinase BTK
(Homo sapiens (Human))
BDBM288308
(US10087188, Example 1 | US10087188, Example 6)
Show SMILES Nc1nccn2c(nc(-c3ccc(cc3)C(=O)Nc3cc(ccn3)C(F)(F)F)c12)[C@@H]1CCC[C@@H](C1)C(O)=O |r|
Show InChI InChI=1S/C26H23F3N6O3/c27-26(28,29)18-8-9-31-19(13-18)33-24(36)15-6-4-14(5-7-15)20-21-22(30)32-10-11-35(21)23(34-20)16-2-1-3-17(12-16)25(37)38/h4-11,13,16-17H,1-3,12H2,(H2,30,32)(H,37,38)(H,31,33,36)/t16-,17+/m1/s1
NCI pathway
Reactome pathway
n/an/a 0.400n/an/an/an/an/an/a
Merck & Co Inc
Curated by ChEMBL
Assay Description
Inhibition of 6-His-tagged recombinant full length BTK (unknown origin) expressed in baculovirus-transfected Sf9 cells using Biotin-EQEDEPEGDYFEWLE-N...
Bioorg Med Chem Lett 27: 1471-1477 (2017)
BindingDB Entry DOI: 10.7270/Q20867K5
1,3-beta-glucan synthase component GLS2
(Saccharomyces cerevisiae)
BDBM288308
(US10087188, Example 1 | US10087188, Example 6)
Show SMILES Nc1nccn2c(nc(-c3ccc(cc3)C(=O)Nc3cc(ccn3)C(F)(F)F)c12)[C@@H]1CCC[C@@H](C1)C(O)=O |r|
Show InChI InChI=1S/C26H23F3N6O3/c27-26(28,29)18-8-9-31-19(13-18)33-24(36)15-6-4-14(5-7-15)20-21-22(30)32-10-11-35(21)23(34-20)16-2-1-3-17(12-16)25(37)38/h4-11,13,16-17H,1-3,12H2,(H2,30,32)(H,37,38)(H,31,33,36)/t16-,17+/m1/s1
n/an/a>6.00E+4n/an/an/an/an/an/a
Merck & Co Inc
Curated by ChEMBL
Assay Description
Inhibition of human ERG
Bioorg Med Chem Lett 27: 1471-1477 (2017)
BindingDB Entry DOI: 10.7270/Q20867K5
Voltage-gated calcium channel
(Homo sapiens (Human))
BDBM288308
(US10087188, Example 1 | US10087188, Example 6)
Show SMILES Nc1nccn2c(nc(-c3ccc(cc3)C(=O)Nc3cc(ccn3)C(F)(F)F)c12)[C@@H]1CCC[C@@H](C1)C(O)=O |r|
Show InChI InChI=1S/C26H23F3N6O3/c27-26(28,29)18-8-9-31-19(13-18)33-24(36)15-6-4-14(5-7-15)20-21-22(30)32-10-11-35(21)23(34-20)16-2-1-3-17(12-16)25(37)38/h4-11,13,16-17H,1-3,12H2,(H2,30,32)(H,37,38)(H,31,33,36)/t16-,17+/m1/s1
n/an/a>3.00E+4n/an/an/an/an/an/a
Merck & Co Inc
Curated by ChEMBL
Assay Description
Inhibition of Cav1.2 (unknown origin)
Bioorg Med Chem Lett 27: 1471-1477 (2017)
BindingDB Entry DOI: 10.7270/Q20867K5
Sodium channel protein type 5 subunit alpha
(Homo sapiens (Human))
BDBM288308
(US10087188, Example 1 | US10087188, Example 6)
Show SMILES Nc1nccn2c(nc(-c3ccc(cc3)C(=O)Nc3cc(ccn3)C(F)(F)F)c12)[C@@H]1CCC[C@@H](C1)C(O)=O |r|
Show InChI InChI=1S/C26H23F3N6O3/c27-26(28,29)18-8-9-31-19(13-18)33-24(36)15-6-4-14(5-7-15)20-21-22(30)32-10-11-35(21)23(34-20)16-2-1-3-17(12-16)25(37)38/h4-11,13,16-17H,1-3,12H2,(H2,30,32)(H,37,38)(H,31,33,36)/t16-,17+/m1/s1
n/an/a>3.00E+4n/an/an/an/an/an/a
Merck & Co Inc
Curated by ChEMBL
Assay Description
Inhibition of Nav1.5 (unknown origin)
Bioorg Med Chem Lett 27: 1471-1477 (2017)
BindingDB Entry DOI: 10.7270/Q20867K5