null
SMILES: Cc1c(Cc2c(nc3c(N)cc(nn23)N2CCOCC2)C(O)CN)cccc1C(F)(F)F
InChI Key: InChIKey=FYPXFJCDZHMXGX-UHFFFAOYSA-N
Activity Spreadsheet -- Enzyme Inhibition Constant Data from BindingDB
Found 5 hits for monomerid = 288395
Trg + Lig
Ki
nM
ΔG°
kcal/mole
IC50
nM
Kd
nM
EC50/IC50
nM
koff
s-1
kon
M-1s-1
pHTemp
°C
Phosphatidylinositol 4-phosphate 3-kinase C2 domain-containing subunit alpha
(Homo sapiens (Human))
BDBM288395
(US10087187, Compound 91)
Show SMILES Cc1c(Cc2c(nc3c(N)cc(nn23)N2CCOCC2)C(O)CN)cccc1C(F)(F)F
Show InChI InChI=1S/C21H25F3N6O2/c1-12-13(3-2-4-14(12)21(22,23)24)9-16-19(17(31)11-25)27-20-15(26)10-18(28-30(16)20)29-5-7-32-8-6-29/h2-4,10,17,31H,5-9,11,25-26H2,1H3
US Patent
n/an/an/a 8.91E+3n/an/an/an/an/a
Janssen Pharmaceutica NV
US Patent
Assay Description
Kinase enzyme binding affinities of compounds disclosed herein were determined using the KINOMEscan technology performed by DiscoveRx Corporation, Sa...
US Patent US10087187 (2018)
BindingDB Entry DOI: 10.7270/Q2M61N9J
Phosphatidylinositol 4-phosphate 3-kinase C2 domain-containing subunit beta
(Homo sapiens (Human))
BDBM288395
(US10087187, Compound 91)
Show SMILES Cc1c(Cc2c(nc3c(N)cc(nn23)N2CCOCC2)C(O)CN)cccc1C(F)(F)F
Show InChI InChI=1S/C21H25F3N6O2/c1-12-13(3-2-4-14(12)21(22,23)24)9-16-19(17(31)11-25)27-20-15(26)10-18(28-30(16)20)29-5-7-32-8-6-29/h2-4,10,17,31H,5-9,11,25-26H2,1H3
NCI pathway
Reactome pathway
US Patent
n/an/an/a 1.10n/an/an/an/an/a
Janssen Pharmaceutica NV
US Patent
Assay Description
Kinase enzyme binding affinities of compounds disclosed herein were determined using the KINOMEscan technology performed by DiscoveRx Corporation, Sa...
US Patent US10087187 (2018)
BindingDB Entry DOI: 10.7270/Q2M61N9J
Serine/threonine-protein kinase mTOR
(Homo sapiens (Human))
BDBM288395
(US10087187, Compound 91)
Show SMILES Cc1c(Cc2c(nc3c(N)cc(nn23)N2CCOCC2)C(O)CN)cccc1C(F)(F)F
Show InChI InChI=1S/C21H25F3N6O2/c1-12-13(3-2-4-14(12)21(22,23)24)9-16-19(17(31)11-25)27-20-15(26)10-18(28-30(16)20)29-5-7-32-8-6-29/h2-4,10,17,31H,5-9,11,25-26H2,1H3
NCI pathway
Reactome pathway
US Patent
n/an/an/a 776n/an/an/an/an/a
Janssen Pharmaceutica NV
US Patent
Assay Description
Kinase enzyme binding affinities of compounds disclosed herein were determined using the KINOMEscan technology performed by DiscoveRx Corporation, Sa...
US Patent US10087187 (2018)
BindingDB Entry DOI: 10.7270/Q2M61N9J
Phosphatidylinositol 4,5-bisphosphate 3-kinase catalytic subunit gamma isoform
(Homo sapiens (Human))
BDBM288395
(US10087187, Compound 91)
Show SMILES Cc1c(Cc2c(nc3c(N)cc(nn23)N2CCOCC2)C(O)CN)cccc1C(F)(F)F
Show InChI InChI=1S/C21H25F3N6O2/c1-12-13(3-2-4-14(12)21(22,23)24)9-16-19(17(31)11-25)27-20-15(26)10-18(28-30(16)20)29-5-7-32-8-6-29/h2-4,10,17,31H,5-9,11,25-26H2,1H3
NCI pathway
Reactome pathway
US Patent
n/an/an/a 8.13E+3n/an/an/an/an/a
Janssen Pharmaceutica NV
US Patent
Assay Description
Kinase enzyme binding affinities of compounds disclosed herein were determined using the KINOMEscan technology performed by DiscoveRx Corporation, Sa...
US Patent US10087187 (2018)
BindingDB Entry DOI: 10.7270/Q2M61N9J
Phosphatidylinositol 4,5-bisphosphate 3-kinase catalytic subunit delta isoform
(Homo sapiens (Human))
BDBM288395
(US10087187, Compound 91)
Show SMILES Cc1c(Cc2c(nc3c(N)cc(nn23)N2CCOCC2)C(O)CN)cccc1C(F)(F)F
Show InChI InChI=1S/C21H25F3N6O2/c1-12-13(3-2-4-14(12)21(22,23)24)9-16-19(17(31)11-25)27-20-15(26)10-18(28-30(16)20)29-5-7-32-8-6-29/h2-4,10,17,31H,5-9,11,25-26H2,1H3
NCI pathway
Reactome pathway
US Patent
n/an/an/a 148n/an/an/an/an/a
Janssen Pharmaceutica NV
US Patent
Assay Description
Kinase enzyme binding affinities of compounds disclosed herein were determined using the KINOMEscan technology performed by DiscoveRx Corporation, Sa...
US Patent US10087187 (2018)
BindingDB Entry DOI: 10.7270/Q2M61N9J