null
SMILES: CCc1c(F)cccc1Cc1c(CNCCO)nc2c(N)cc(nn12)N1CCOCC1
InChI Key: InChIKey=MIPLTGRLSDZLQU-UHFFFAOYSA-N
Activity Spreadsheet -- Enzyme Inhibition Constant Data from BindingDB
Found 5 hits for monomerid = 288400
Trg + Lig
Ki
nM
ΔG°
kcal/mole
IC50
nM
Kd
nM
EC50/IC50
nM
koff
s-1
kon
M-1s-1
pHTemp
°C
Phosphatidylinositol 4-phosphate 3-kinase C2 domain-containing subunit alpha
(Homo sapiens (Human))
BDBM288400
(US10087187, Compound 101)
Show SMILES CCc1c(F)cccc1Cc1c(CNCCO)nc2c(N)cc(nn12)N1CCOCC1
Show InChI InChI=1S/C22H29FN6O2/c1-2-16-15(4-3-5-17(16)23)12-20-19(14-25-6-9-30)26-22-18(24)13-21(27-29(20)22)28-7-10-31-11-8-28/h3-5,13,25,30H,2,6-12,14,24H2,1H3
US Patent
n/an/an/a 5.89E+3n/an/an/an/an/a
Janssen Pharmaceutica NV
US Patent
Assay Description
Kinase enzyme binding affinities of compounds disclosed herein were determined using the KINOMEscan technology performed by DiscoveRx Corporation, Sa...
US Patent US10087187 (2018)
BindingDB Entry DOI: 10.7270/Q2M61N9J
Phosphatidylinositol 4-phosphate 3-kinase C2 domain-containing subunit beta
(Homo sapiens (Human))
BDBM288400
(US10087187, Compound 101)
Show SMILES CCc1c(F)cccc1Cc1c(CNCCO)nc2c(N)cc(nn12)N1CCOCC1
Show InChI InChI=1S/C22H29FN6O2/c1-2-16-15(4-3-5-17(16)23)12-20-19(14-25-6-9-30)26-22-18(24)13-21(27-29(20)22)28-7-10-31-11-8-28/h3-5,13,25,30H,2,6-12,14,24H2,1H3
NCI pathway
Reactome pathway
US Patent
n/an/an/a 6.20n/an/an/an/an/a
Janssen Pharmaceutica NV
US Patent
Assay Description
Kinase enzyme binding affinities of compounds disclosed herein were determined using the KINOMEscan technology performed by DiscoveRx Corporation, Sa...
US Patent US10087187 (2018)
BindingDB Entry DOI: 10.7270/Q2M61N9J
Serine/threonine-protein kinase mTOR
(Homo sapiens (Human))
BDBM288400
(US10087187, Compound 101)
Show SMILES CCc1c(F)cccc1Cc1c(CNCCO)nc2c(N)cc(nn12)N1CCOCC1
Show InChI InChI=1S/C22H29FN6O2/c1-2-16-15(4-3-5-17(16)23)12-20-19(14-25-6-9-30)26-22-18(24)13-21(27-29(20)22)28-7-10-31-11-8-28/h3-5,13,25,30H,2,6-12,14,24H2,1H3
NCI pathway
Reactome pathway
US Patent
n/an/an/a 1.59E+3n/an/an/an/an/a
Janssen Pharmaceutica NV
US Patent
Assay Description
Kinase enzyme binding affinities of compounds disclosed herein were determined using the KINOMEscan technology performed by DiscoveRx Corporation, Sa...
US Patent US10087187 (2018)
BindingDB Entry DOI: 10.7270/Q2M61N9J
Phosphatidylinositol 4,5-bisphosphate 3-kinase catalytic subunit gamma isoform
(Homo sapiens (Human))
BDBM288400
(US10087187, Compound 101)
Show SMILES CCc1c(F)cccc1Cc1c(CNCCO)nc2c(N)cc(nn12)N1CCOCC1
Show InChI InChI=1S/C22H29FN6O2/c1-2-16-15(4-3-5-17(16)23)12-20-19(14-25-6-9-30)26-22-18(24)13-21(27-29(20)22)28-7-10-31-11-8-28/h3-5,13,25,30H,2,6-12,14,24H2,1H3
NCI pathway
Reactome pathway
US Patent
n/an/an/a 724n/an/an/an/an/a
Janssen Pharmaceutica NV
US Patent
Assay Description
Kinase enzyme binding affinities of compounds disclosed herein were determined using the KINOMEscan technology performed by DiscoveRx Corporation, Sa...
US Patent US10087187 (2018)
BindingDB Entry DOI: 10.7270/Q2M61N9J
Phosphatidylinositol 4,5-bisphosphate 3-kinase catalytic subunit delta isoform
(Homo sapiens (Human))
BDBM288400
(US10087187, Compound 101)
Show SMILES CCc1c(F)cccc1Cc1c(CNCCO)nc2c(N)cc(nn12)N1CCOCC1
Show InChI InChI=1S/C22H29FN6O2/c1-2-16-15(4-3-5-17(16)23)12-20-19(14-25-6-9-30)26-22-18(24)13-21(27-29(20)22)28-7-10-31-11-8-28/h3-5,13,25,30H,2,6-12,14,24H2,1H3
NCI pathway
Reactome pathway
US Patent
n/an/an/a 427n/an/an/an/an/a
Janssen Pharmaceutica NV
US Patent
Assay Description
Kinase enzyme binding affinities of compounds disclosed herein were determined using the KINOMEscan technology performed by DiscoveRx Corporation, Sa...
US Patent US10087187 (2018)
BindingDB Entry DOI: 10.7270/Q2M61N9J