BDBM288447 US10087188, Example 54::{(1S,3R)-3-[8-amino- 1-(4-{[4- (trifluoromethyl) pyridin-2- yl]carbamoyl}phenyl) imidazo[1,5-a]pyrazin- 3- yl]cyclopentyl}acetic acid
SMILES: Nc1nccn2c(nc(-c3ccc(cc3)C(=O)Nc3cc(ccn3)C(F)(F)F)c12)[C@@H]1CC[C@H](CC(O)=O)C1
InChI Key: InChIKey=OJKCSLPTAULNTD-WMLDXEAASA-N
Data: 1 IC50
Activity Spreadsheet -- Enzyme Inhibition Constant Data from BindingDB
Found 1 hit for monomerid = 288447
Trg + Lig
Ki
nM
ΔG°
kcal/mole
IC50
nM
Kd
nM
EC50/IC50
nM
koff
s-1
kon
M-1s-1
pHTemp
°C
Tyrosine-protein kinase BTK
(Homo sapiens (Human))
BDBM288447
(US10087188, Example 54 | {(1S,3R)-3-[8-amino- 1-(4...)
Show SMILES Nc1nccn2c(nc(-c3ccc(cc3)C(=O)Nc3cc(ccn3)C(F)(F)F)c12)[C@@H]1CC[C@H](CC(O)=O)C1 |r|
Show InChI InChI=1S/C26H23F3N6O3/c27-26(28,29)18-7-8-31-19(13-18)33-25(38)16-5-3-15(4-6-16)21-22-23(30)32-9-10-35(22)24(34-21)17-2-1-14(11-17)12-20(36)37/h3-10,13-14,17H,1-2,11-12H2,(H2,30,32)(H,36,37)(H,31,33,38)/t14-,17+/m0/s1
NCI pathway
Reactome pathway
US Patent
n/an/a 0.180n/an/an/an/an/an/a
Merck Sharp & Dohme Corp.
US Patent
Assay Description
BTK enzymatic activity was determined with the LANCE (Lanthanide Chelate Excite) TR-FRET (Time-resolved fluorescence resonance energy transfer) assay...
US Patent US10087188 (2018)
BindingDB Entry DOI: 10.7270/Q2GF0WJC