BDBM288469 4-(8-amino-1-(4-((4- cyanopyridin-2- yl)carbamoyl)-2- fluorophenyl)imidazo [1,5-a]pyrazin-3- yl)cubane-1- carboxylic acid::US10087188, Example 76
SMILES: Nc1nccn2c(nc(-c3ccc(cc3F)C(=O)Nc3cc(ccn3)C#N)c12)C12C3C4C1C1C2C3C41C(O)=O
InChI Key: InChIKey=ILNNMAHAXXPJPF-UHFFFAOYSA-N
Data: 1 IC50
Activity Spreadsheet -- Enzyme Inhibition Constant Data from BindingDB
Found 1 hit for monomerid = 288469
Trg + Lig
Ki
nM
ΔG°
kcal/mole
IC50
nM
Kd
nM
EC50/IC50
nM
koff
s-1
kon
M-1s-1
pHTemp
°C
Tyrosine-protein kinase BTK
(Homo sapiens (Human))
BDBM288469
(4-(8-amino-1-(4-((4- cyanopyridin-2- yl)carbamoyl)...)
Show SMILES Nc1nccn2c(nc(-c3ccc(cc3F)C(=O)Nc3cc(ccn3)C#N)c12)C12C3C4C1C1C2C3C41C(O)=O |(-5.29,2.33,;-5.68,.84,;-7.19,.52,;-7.67,-.95,;-6.64,-2.09,;-5.13,-1.77,;-3.88,-2.68,;-2.64,-1.77,;-3.11,-.31,;-2.34,1.03,;-3.11,2.36,;-2.34,3.69,;-.8,3.69,;-.03,2.36,;-.8,1.03,;-.03,-.31,;-.03,5.03,;-.8,6.36,;1.51,5.03,;2.28,6.36,;3.82,6.36,;4.59,7.7,;3.82,9.03,;2.28,9.03,;1.51,7.7,;6.13,7.7,;7.67,7.7,;-4.65,-.31,;-3.88,-4.22,;-2.4,-4.61,;-1.63,-5.95,;-3.11,-5.55,;-4.45,-6.32,;-5.22,-4.99,;-3.73,-5.38,;-2.96,-6.72,;-2.96,-8.26,;-4.3,-9.03,;-1.63,-9.03,)|
Show InChI InChI=1S/C28H18FN7O3/c29-13-8-11(24(37)34-14-7-10(9-30)3-4-32-14)1-2-12(13)21-22-23(31)33-5-6-36(22)25(35-21)27-15-18-16(27)20-17(27)19(15)28(18,20)26(38)39/h1-8,15-20H,(H2,31,33)(H,38,39)(H,32,34,37)
NCI pathway
Reactome pathway
US Patent
n/an/a 0.410n/an/an/an/an/an/a
Merck Sharp & Dohme Corp.
US Patent
Assay Description
BTK enzymatic activity was determined with the LANCE (Lanthanide Chelate Excite) TR-FRET (Time-resolved fluorescence resonance energy transfer) assay...
US Patent US10087188 (2018)
BindingDB Entry DOI: 10.7270/Q2GF0WJC