BDBM288508 (1S,3R)-3-[8-amino-1- (2-fluoro-6-methoxy- 4-{[4- (trifluoromethyl) pyridin-2- yl]carbamoyl}phenyl) imidazo[1,5-a]pyrazin- 3-yl]-1,2,2- trimethylcyclopentane carboxylic acid::US10087188, Example 115
SMILES: COc1cc(cc(F)c1-c1nc([C@@H]2CC[C@](C)(C(O)=O)C2(C)C)n2ccnc(N)c12)C(=O)Nc1cc(ccn1)C(F)(F)F
InChI Key: InChIKey=KCJOXBJMGZYELW-DEXQXJORSA-N
Data: 1 IC50
Activity Spreadsheet -- Enzyme Inhibition Constant Data from BindingDB
Found 1 hit for monomerid = 288508
Trg + Lig
Ki
nM
ΔG°
kcal/mole
IC50
nM
Kd
nM
EC50/IC50
nM
koff
s-1
kon
M-1s-1
pHTemp
°C
Tyrosine-protein kinase BTK
(Homo sapiens (Human))
BDBM288508
((1S,3R)-3-[8-amino-1- (2-fluoro-6-methoxy- 4-{[4- ...)
Show SMILES COc1cc(cc(F)c1-c1nc([C@@H]2CC[C@](C)(C(O)=O)C2(C)C)n2ccnc(N)c12)C(=O)Nc1cc(ccn1)C(F)(F)F |r,wU:12.12,15.17,wD:15.16,(1.96,-3.6,;2.36,-2.11,;1.27,-1.02,;1.67,.47,;.58,1.56,;-.91,1.16,;-1.31,-.33,;-2.8,.07,;-.22,-1.42,;-.62,-2.91,;.29,-4.15,;-.62,-5.4,;.15,-6.73,;-.75,-7.98,;.15,-9.22,;1.62,-8.75,;2.39,-10.08,;3.16,-8.75,;3.93,-10.08,;3.93,-7.41,;1.62,-7.21,;3.16,-7.21,;2.39,-5.87,;-2.08,-4.92,;-3.42,-5.69,;-4.75,-4.92,;-4.75,-3.38,;-3.42,-2.61,;-3.42,-1.07,;-2.08,-3.38,;.98,3.04,;-.11,4.13,;2.46,3.44,;2.86,4.93,;1.77,6.02,;2.17,7.51,;3.66,7.9,;4.75,6.82,;4.35,5.33,;1.08,8.59,;-.4,8.2,;1.48,10.08,;-.01,9.68,)|
Show InChI InChI=1S/C29H28F4N6O4/c1-27(2)16(5-7-28(27,3)26(41)42)24-38-21(22-23(34)36-9-10-39(22)24)20-17(30)11-14(12-18(20)43-4)25(40)37-19-13-15(6-8-35-19)29(31,32)33/h6,8-13,16H,5,7H2,1-4H3,(H2,34,36)(H,41,42)(H,35,37,40)/t16-,28+/m0/s1
NCI pathway
Reactome pathway
US Patent
n/an/a 0.260n/an/an/an/an/an/a
Merck Sharp & Dohme Corp.
US Patent
Assay Description
BTK enzymatic activity was determined with the LANCE (Lanthanide Chelate Excite) TR-FRET (Time-resolved fluorescence resonance energy transfer) assay...
US Patent US10087188 (2018)
BindingDB Entry DOI: 10.7270/Q2GF0WJC