BDBM288692 TC001265::US10092529, Compound 31
SMILES: CCC(C)(C)C(=O)N1[C@@H](CN(C)C1=O)c1ccccc1
InChI Key: InChIKey=RIXQSEAIUKFMQQ-ZDUSSCGKSA-N
Data: 1 KI
Activity Spreadsheet -- Enzyme Inhibition Constant Data from BindingDB
Found 1 hit for monomerid = 288692
Trg + Lig
Ki
nM
ΔG°
kcal/mole
IC50
nM
Kd
nM
EC50/IC50
nM
koff
s-1
kon
M-1s-1
pHTemp
°C
Receptor-interacting serine/threonine-protein kinase 1
(Homo sapiens (Human))
BDBM288692
(TC001265 | US10092529, Compound 31)
Show SMILES CCC(C)(C)C(=O)N1[C@@H](CN(C)C1=O)c1ccccc1 |r|
Show InChI InChI=1S/C16H22N2O2/c1-5-16(2,3)14(19)18-13(11-17(4)15(18)20)12-9-7-6-8-10-12/h6-10,13H,5,11H2,1-4H3/t13-/m0/s1
US Patent
1.07E+3 -8.14n/an/an/an/an/an/a25
National Institute of Biological Sciences, Beijing
US Patent
Assay Description
Materials: Recombinant full-length RIPK1 protein with N-terminal GST-tag (Cat#R07-34G) was purchased from SignalChem. The ADP-Glo kinase assay kit (C...
US Patent US10092529 (2018)
BindingDB Entry DOI: 10.7270/Q26W9D35