BDBM28923 (2S)-N-(4-chlorophenyl)-3-ethyl-1-hydroxypentane-2-sulfonamido::BMCL184232 Compound 8e::Begacestat analogue, 7
SMILES: CCC(CC)[C@@H](CO)NS(=O)(=O)c1ccc(Cl)cc1
InChI Key: InChIKey=KBVZDYCSYMTCEV-CYBMUJFWSA-N
Data: 2 EC50
Activity Spreadsheet -- Enzyme Inhibition Constant Data from BindingDB
Found 2 hits for monomerid = 28923
Trg + Lig
Ki
nM
ΔG°
kcal/mole
IC50
nM
Kd
nM
EC50/IC50
nM
koff
s-1
kon
M-1s-1
pHTemp
°C
Gamma-Secretase
(Homo sapiens (Human))
BDBM28923
((2S)-N-(4-chlorophenyl)-3-ethyl-1-hydroxypentane-2...)
Show SMILES CCC(CC)[C@@H](CO)NS(=O)(=O)c1ccc(Cl)cc1 |r|
Show InChI InChI=1S/C13H20ClNO3S/c1-3-10(4-2)13(9-16)15-19(17,18)12-7-5-11(14)6-8-12/h5-8,10,13,15-16H,3-4,9H2,1-2H3/t13-/m1/s1
NCI pathway
Reactome pathway
n/an/an/an/a 294n/an/an/an/a
Wyeth Research
Assay Description
A Chinese Hamster Ovary cell line stably expressing human beta-APP were aliquoted into a 96-well plate, and after attachment the medium was replaced ...
Bioorg Med Chem Lett 18: 4232-6 (2008)
Article DOI: 10.1016/j.bmcl.2008.05.064
BindingDB Entry DOI: 10.7270/Q26Q1VJM
Gamma-Secretase
(Homo sapiens (Human))
BDBM28923
((2S)-N-(4-chlorophenyl)-3-ethyl-1-hydroxypentane-2...)
Show SMILES CCC(CC)[C@@H](CO)NS(=O)(=O)c1ccc(Cl)cc1 |r|
Show InChI InChI=1S/C13H20ClNO3S/c1-3-10(4-2)13(9-16)15-19(17,18)12-7-5-11(14)6-8-12/h5-8,10,13,15-16H,3-4,9H2,1-2H3/t13-/m1/s1
NCI pathway
Reactome pathway
n/an/an/an/a 294n/an/an/an/a
Wyeth Research
Assay Description
A Chinese Hamster Ovary cell line stably expressing human beta-APP were aliquoted into a 96-well plate, and after attachment the medium was replaced ...
J Med Chem 51: 7348-51 (2008)
Article DOI: 10.1021/jm801252w
BindingDB Entry DOI: 10.7270/Q2BC3WW2