BDBM28927 (2R)-N-(5-chlorothiophen-2-yl)-4,4,4-trifluoro-1-hydroxy-3-(trifluoromethyl)butane-2-sulfonamido::Begacestat analogue, 16
SMILES: OC[C@H](NS(=O)(=O)c1ccc(Cl)s1)C(C(F)(F)F)C(F)(F)F
InChI Key: InChIKey=PSXOKXJMVRSARX-BYPYZUCNSA-N
Data: 2 IC50  1 EC50
Activity Spreadsheet -- Enzyme Inhibition Constant Data from BindingDB
Found 3 hits for monomerid = 28927
Trg + Lig
Ki
nM
ΔG°
kcal/mole
IC50
nM
Kd
nM
EC50/IC50
nM
koff
s-1
kon
M-1s-1
pHTemp
°C
Gamma-Secretase
(Homo sapiens (Human))
BDBM28927
((2R)-N-(5-chlorothiophen-2-yl)-4,4,4-trifluoro-1-h...)
Show SMILES OC[C@H](NS(=O)(=O)c1ccc(Cl)s1)C(C(F)(F)F)C(F)(F)F |r|
Show InChI InChI=1S/C9H8ClF6NO3S2/c10-5-1-2-6(21-5)22(19,20)17-4(3-18)7(8(11,12)13)9(14,15)16/h1-2,4,7,17-18H,3H2/t4-/m0/s1
NCI pathway
Reactome pathway
n/an/an/an/a 1.07E+4n/an/an/an/a
Wyeth Research
Assay Description
A Chinese Hamster Ovary cell line stably expressing human beta-APP were aliquoted into a 96-well plate, and after attachment the medium was replaced ...
J Med Chem 51: 7348-51 (2008)
Article DOI: 10.1021/jm801252w
BindingDB Entry DOI: 10.7270/Q2BC3WW2
Presenilin-1
(Homo sapiens (Human))
BDBM28927
((2R)-N-(5-chlorothiophen-2-yl)-4,4,4-trifluoro-1-h...)
Show SMILES OC[C@H](NS(=O)(=O)c1ccc(Cl)s1)C(C(F)(F)F)C(F)(F)F |r|
Show InChI InChI=1S/C9H8ClF6NO3S2/c10-5-1-2-6(21-5)22(19,20)17-4(3-18)7(8(11,12)13)9(14,15)16/h1-2,4,7,17-18H,3H2/t4-/m0/s1
n/an/a 8n/an/an/an/an/an/a
Indian Institute of Technology (Banaras Hindu University)
Curated by ChEMBL
Assay Description
Inhibition of gamma-secretase (unknown origin) assessed as reduction in amyloid beta (1 to 42) production
Eur J Med Chem 148: 436-452 (2018)
Article DOI: 10.1016/j.ejmech.2018.02.035
BindingDB Entry DOI: 10.7270/Q2G73HCN
Presenilin-1
(Homo sapiens (Human))
BDBM28927
((2R)-N-(5-chlorothiophen-2-yl)-4,4,4-trifluoro-1-h...)
Show SMILES OC[C@H](NS(=O)(=O)c1ccc(Cl)s1)C(C(F)(F)F)C(F)(F)F |r|
Show InChI InChI=1S/C9H8ClF6NO3S2/c10-5-1-2-6(21-5)22(19,20)17-4(3-18)7(8(11,12)13)9(14,15)16/h1-2,4,7,17-18H,3H2/t4-/m0/s1
n/an/a 15n/an/an/an/an/an/a
Indian Institute of Technology (Banaras Hindu University)
Curated by ChEMBL
Assay Description
Inhibition of gamma-secretase (unknown origin) assessed as reduction in amyloid beta (1 to 42) production by cell based assay
Eur J Med Chem 148: 436-452 (2018)
Article DOI: 10.1016/j.ejmech.2018.02.035
BindingDB Entry DOI: 10.7270/Q2G73HCN