BDBM28944 (2S)-2-hydroxy-3-methyl-N-[(1S)-1-{[(1S)-3-methyl-2-oxo-2,3,4,5-tetrahydro-1H-3-benzazepin-1-yl]carbamoyl}ethyl]butanamide::LY450139::Semagacestat
SMILES: CC(C)[C@H](O)C(=O)N[C@@H](C)C(=O)N[C@H]1c2ccccc2CCN(C)C1=O
InChI Key: InChIKey=PKXWXXPNHIWQHW-RCBQFDQVSA-N
Data: 8 IC50  2 EC50
PDB links: 1 PDB ID matches this monomer.
Activity Spreadsheet -- Enzyme Inhibition Constant Data from BindingDB
Found 10 hits for monomerid = 28944
Trg + Lig
Ki
nM
ΔG°
kcal/mole
IC50
nM
Kd
nM
EC50/IC50
nM
koff
s-1
kon
M-1s-1
pHTemp
°C
Gamma-Secretase
(Homo sapiens (Human))
BDBM28944
((2S)-2-hydroxy-3-methyl-N-[(1S)-1-{[(1S)-3-methyl-...)
Show SMILES CC(C)[C@H](O)C(=O)N[C@@H](C)C(=O)N[C@H]1c2ccccc2CCN(C)C1=O |r|
Show InChI InChI=1S/C19H27N3O4/c1-11(2)16(23)18(25)20-12(3)17(24)21-15-14-8-6-5-7-13(14)9-10-22(4)19(15)26/h5-8,11-12,15-16,23H,9-10H2,1-4H3,(H,20,25)(H,21,24)/t12-,15-,16-/m0/s1
NCI pathway
Reactome pathway
n/an/an/an/a 28n/an/an/an/a
Wyeth Research
Assay Description
A Chinese Hamster Ovary cell line stably expressing human beta-APP were aliquoted into a 96-well plate, and after attachment the medium was replaced ...
Bioorg Med Chem Lett 18: 4232-6 (2008)
Article DOI: 10.1016/j.bmcl.2008.05.064
BindingDB Entry DOI: 10.7270/Q26Q1VJM
3D
3D Structure (crystal)
Bile salt export pump
(Homo sapiens (Human))
BDBM28944
((2S)-2-hydroxy-3-methyl-N-[(1S)-1-{[(1S)-3-methyl-...)
Show SMILES CC(C)[C@H](O)C(=O)N[C@@H](C)C(=O)N[C@H]1c2ccccc2CCN(C)C1=O |r|
Show InChI InChI=1S/C19H27N3O4/c1-11(2)16(23)18(25)20-12(3)17(24)21-15-14-8-6-5-7-13(14)9-10-22(4)19(15)26/h5-8,11-12,15-16,23H,9-10H2,1-4H3,(H,20,25)(H,21,24)/t12-,15-,16-/m0/s1
n/an/a 4.72E+5n/an/an/an/an/an/a
AstraZeneca
Curated by ChEMBL
Assay Description
Inhibition of human BSEP expressed in baculovirus transfected fall armyworm Sf21 cell membranes vesicles assessed as reduction in ATP-dependent [3H]-...
Drug Metab Dispos 40: 2332-41 (2012)
Article DOI: 10.1124/dmd.112.047068
BindingDB Entry DOI: 10.7270/Q2ZP488M
Presenilin-1
(Homo sapiens (Human))
BDBM28944
((2S)-2-hydroxy-3-methyl-N-[(1S)-1-{[(1S)-3-methyl-...)
Show SMILES CC(C)[C@H](O)C(=O)N[C@@H](C)C(=O)N[C@H]1c2ccccc2CCN(C)C1=O |r|
Show InChI InChI=1S/C19H27N3O4/c1-11(2)16(23)18(25)20-12(3)17(24)21-15-14-8-6-5-7-13(14)9-10-22(4)19(15)26/h5-8,11-12,15-16,23H,9-10H2,1-4H3,(H,20,25)(H,21,24)/t12-,15-,16-/m0/s1
n/an/a 40n/an/an/an/an/an/a
GlaxoSmithKline
Curated by ChEMBL
Assay Description
Inhibition of gamma-secretase in human SHSY5Y cells expressing human recombinant APP assessed as amyloid beta42 formation by ELISA
Bioorg Med Chem Lett 20: 1306-11 (2010)
Article DOI: 10.1016/j.bmcl.2009.08.072
BindingDB Entry DOI: 10.7270/Q2M32ZK6
3D
3D Structure (crystal)
Presenilin-1
(Homo sapiens (Human))
BDBM28944
((2S)-2-hydroxy-3-methyl-N-[(1S)-1-{[(1S)-3-methyl-...)
Show SMILES CC(C)[C@H](O)C(=O)N[C@@H](C)C(=O)N[C@H]1c2ccccc2CCN(C)C1=O |r|
Show InChI InChI=1S/C19H27N3O4/c1-11(2)16(23)18(25)20-12(3)17(24)21-15-14-8-6-5-7-13(14)9-10-22(4)19(15)26/h5-8,11-12,15-16,23H,9-10H2,1-4H3,(H,20,25)(H,21,24)/t12-,15-,16-/m0/s1
n/an/a 100n/an/an/an/an/an/a
GlaxoSmithKline
Curated by ChEMBL
Assay Description
Inhibition of gamma-secretase in human SHSY5Y cells expressing human recombinant APP assessed as decrease in total Abeta level after 24 hrs by DELFIA
Bioorg Med Chem Lett 20: 1306-11 (2010)
Article DOI: 10.1016/j.bmcl.2009.08.072
BindingDB Entry DOI: 10.7270/Q2M32ZK6
3D
3D Structure (crystal)
Presenilin-1
(Homo sapiens (Human))
BDBM28944
((2S)-2-hydroxy-3-methyl-N-[(1S)-1-{[(1S)-3-methyl-...)
Show SMILES CC(C)[C@H](O)C(=O)N[C@@H](C)C(=O)N[C@H]1c2ccccc2CCN(C)C1=O |r|
Show InChI InChI=1S/C19H27N3O4/c1-11(2)16(23)18(25)20-12(3)17(24)21-15-14-8-6-5-7-13(14)9-10-22(4)19(15)26/h5-8,11-12,15-16,23H,9-10H2,1-4H3,(H,20,25)(H,21,24)/t12-,15-,16-/m0/s1
n/an/a 14n/an/an/an/an/an/a
Centre Hospitalier Universitaire Vaudois (CHUV)
Curated by ChEMBL
Assay Description
Inhibition of gamma secretase (unknown origin) mediated Notch signaling
J Med Chem 59: 7719-37 (2016)
Article DOI: 10.1021/acs.jmedchem.5b01516
3D
3D Structure (crystal)
Presenilin-1
(Homo sapiens (Human))
BDBM28944
((2S)-2-hydroxy-3-methyl-N-[(1S)-1-{[(1S)-3-methyl-...)
Show SMILES CC(C)[C@H](O)C(=O)N[C@@H](C)C(=O)N[C@H]1c2ccccc2CCN(C)C1=O |r|
Show InChI InChI=1S/C19H27N3O4/c1-11(2)16(23)18(25)20-12(3)17(24)21-15-14-8-6-5-7-13(14)9-10-22(4)19(15)26/h5-8,11-12,15-16,23H,9-10H2,1-4H3,(H,20,25)(H,21,24)/t12-,15-,16-/m0/s1
n/an/an/an/a 126n/an/an/an/a
GlaxoSmithKline
Curated by ChEMBL
Assay Description
Inhibition of gamma-secretase in human SHSY5Y cells expressing human recombinant APP assessed as increase in Abeta38 level after 24 hrs by DELFIA
Bioorg Med Chem Lett 20: 1306-11 (2010)
Article DOI: 10.1016/j.bmcl.2009.08.072
BindingDB Entry DOI: 10.7270/Q2M32ZK6
3D
3D Structure (crystal)
Presenilin-1
(Homo sapiens (Human))
BDBM28944
((2S)-2-hydroxy-3-methyl-N-[(1S)-1-{[(1S)-3-methyl-...)
Show SMILES CC(C)[C@H](O)C(=O)N[C@@H](C)C(=O)N[C@H]1c2ccccc2CCN(C)C1=O |r|
Show InChI InChI=1S/C19H27N3O4/c1-11(2)16(23)18(25)20-12(3)17(24)21-15-14-8-6-5-7-13(14)9-10-22(4)19(15)26/h5-8,11-12,15-16,23H,9-10H2,1-4H3,(H,20,25)(H,21,24)/t12-,15-,16-/m0/s1
n/an/a 200n/an/an/an/an/an/a
GlaxoSmithKline
Curated by ChEMBL
Assay Description
Inhibition of gamma-secretase in human SHSY5Y cells expressing human recombinant APP assessed as effect on Abeta40 level after 24 hrs by DELFIA
Bioorg Med Chem Lett 20: 1306-11 (2010)
Article DOI: 10.1016/j.bmcl.2009.08.072
BindingDB Entry DOI: 10.7270/Q2M32ZK6
3D
3D Structure (crystal)
Presenilin-1
(Homo sapiens (Human))
BDBM28944
((2S)-2-hydroxy-3-methyl-N-[(1S)-1-{[(1S)-3-methyl-...)
Show SMILES CC(C)[C@H](O)C(=O)N[C@@H](C)C(=O)N[C@H]1c2ccccc2CCN(C)C1=O |r|
Show InChI InChI=1S/C19H27N3O4/c1-11(2)16(23)18(25)20-12(3)17(24)21-15-14-8-6-5-7-13(14)9-10-22(4)19(15)26/h5-8,11-12,15-16,23H,9-10H2,1-4H3,(H,20,25)(H,21,24)/t12-,15-,16-/m0/s1
n/an/a 40n/an/an/an/an/an/a
GlaxoSmithKline
Curated by ChEMBL
Assay Description
Inhibition of gamma-secretase in human SHSY5Y cells expressing human recombinant APP assessed as amyloid beta40 formation by ELISA
Bioorg Med Chem Lett 20: 1306-11 (2010)
Article DOI: 10.1016/j.bmcl.2009.08.072
BindingDB Entry DOI: 10.7270/Q2M32ZK6
3D
3D Structure (crystal)
Presenilin-1
(Homo sapiens (Human))
BDBM28944
((2S)-2-hydroxy-3-methyl-N-[(1S)-1-{[(1S)-3-methyl-...)
Show SMILES CC(C)[C@H](O)C(=O)N[C@@H](C)C(=O)N[C@H]1c2ccccc2CCN(C)C1=O |r|
Show InChI InChI=1S/C19H27N3O4/c1-11(2)16(23)18(25)20-12(3)17(24)21-15-14-8-6-5-7-13(14)9-10-22(4)19(15)26/h5-8,11-12,15-16,23H,9-10H2,1-4H3,(H,20,25)(H,21,24)/t12-,15-,16-/m0/s1
n/an/a 11n/an/an/an/an/an/a
Centre Hospitalier Universitaire Vaudois (CHUV)
Curated by ChEMBL
Assay Description
Inhibition of gamma secretase (unknown origin)
J Med Chem 59: 7719-37 (2016)
Article DOI: 10.1021/acs.jmedchem.5b01516
3D
3D Structure (crystal)
Presenilin-1
(Homo sapiens (Human))
BDBM28944
((2S)-2-hydroxy-3-methyl-N-[(1S)-1-{[(1S)-3-methyl-...)
Show SMILES CC(C)[C@H](O)C(=O)N[C@@H](C)C(=O)N[C@H]1c2ccccc2CCN(C)C1=O |r|
Show InChI InChI=1S/C19H27N3O4/c1-11(2)16(23)18(25)20-12(3)17(24)21-15-14-8-6-5-7-13(14)9-10-22(4)19(15)26/h5-8,11-12,15-16,23H,9-10H2,1-4H3,(H,20,25)(H,21,24)/t12-,15-,16-/m0/s1
n/an/a 126n/an/an/an/an/an/a
GlaxoSmithKline
Curated by ChEMBL
Assay Description
Inhibition of gamma-secretase in human SHSY5Y cells expressing human recombinant APP assessed as decrease in Abeta42 level after 24 hrs by DELFIA
Bioorg Med Chem Lett 20: 1306-11 (2010)
Article DOI: 10.1016/j.bmcl.2009.08.072
BindingDB Entry DOI: 10.7270/Q2M32ZK6
3D
3D Structure (crystal)