BDBM289613 6-(4-Chlorobenzyl)-9-methyl-8,9,10,11-tetrahydropyrido[4',3':4,5]thieno[3,2-e][1,2,4]triazolo[1,5-c]pyrimidin-5(6H)-one::US10092575, Example 101::US10376514, Example 101
SMILES: CN1CCc2c(C1)sc1n(Cc3ccc(Cl)cc3)c(=O)n3ncnc3c21
InChI Key: InChIKey=AXPVGJNPJSMCLA-UHFFFAOYSA-N
Data: 5 IC50  1 EC50
Activity Spreadsheet -- Enzyme Inhibition Constant Data from BindingDB
Found 6 hits for monomerid = 289613
Trg + Lig
Ki
nM
ΔG°
kcal/mole
IC50
nM
Kd
nM
EC50/IC50
nM
koff
s-1
kon
M-1s-1
pHTemp
°C
Calcium/calmodulin-dependent 3',5'-cyclic nucleotide phosphodiesterase 1B
(Homo sapiens (Human))
BDBM289613
(6-(4-Chlorobenzyl)-9-methyl-8,9,10,11-tetrahydropy...)
Show SMILES CN1CCc2c(C1)sc1n(Cc3ccc(Cl)cc3)c(=O)n3ncnc3c21
Show InChI InChI=1S/C18H16ClN5OS/c1-22-7-6-13-14(9-22)26-17-15(13)16-20-10-21-24(16)18(25)23(17)8-11-2-4-12(19)5-3-11/h2-5,10H,6-9H2,1H3
Reactome pathway
US Patent
n/an/a 550n/an/an/an/an/a25
DART NEUROSCIENCE (CAYMAN) LTD.
US Patent
Assay Description
PDE1B inhibition was determined by an IMAP TR-FRET assay. The IMAP TR-FRET PDE assay was optimized for concentration of enzyme, Calmodulin, cAMP or c...
US Patent US10105367 (2018)
BindingDB Entry DOI: 10.7270/Q2KW5J3Q
Calcium/calmodulin-dependent 3',5'-cyclic nucleotide phosphodiesterase 1B
(Homo sapiens (Human))
BDBM289613
(6-(4-Chlorobenzyl)-9-methyl-8,9,10,11-tetrahydropy...)
Show SMILES CN1CCc2c(C1)sc1n(Cc3ccc(Cl)cc3)c(=O)n3ncnc3c21
Show InChI InChI=1S/C18H16ClN5OS/c1-22-7-6-13-14(9-22)26-17-15(13)16-20-10-21-24(16)18(25)23(17)8-11-2-4-12(19)5-3-11/h2-5,10H,6-9H2,1H3
Reactome pathway
US Patent
n/an/an/an/a 550n/an/an/a25
Dart NeuroScience (Cayman) Ltd.
US Patent
Assay Description
The IMAP TR-FRET PDE assay was optimized for concentration of enzyme, Calmodulin, cAMP or cGMP substrate, DMSO tolerance, and incubation time. Into e...
US Patent US10092575 (2018)
BindingDB Entry DOI: 10.7270/Q2514181
Calcium/calmodulin-dependent 3',5'-cyclic nucleotide phosphodiesterase 1B
(Homo sapiens (Human))
BDBM289613
(6-(4-Chlorobenzyl)-9-methyl-8,9,10,11-tetrahydropy...)
Show SMILES CN1CCc2c(C1)sc1n(Cc3ccc(Cl)cc3)c(=O)n3ncnc3c21
Show InChI InChI=1S/C18H16ClN5OS/c1-22-7-6-13-14(9-22)26-17-15(13)16-20-10-21-24(16)18(25)23(17)8-11-2-4-12(19)5-3-11/h2-5,10H,6-9H2,1H3
Reactome pathway
US Patent
n/an/a 550n/an/an/an/an/an/a
Dart NeuroScience (Cayman) Ltd
US Patent
Assay Description
The selectivity of compounds of the present invention was determined using a panel of recombinant human PDEs and an in vitro enzymatic assay (BPS Bio...
US Patent US10376514 (2019)
BindingDB Entry DOI: 10.7270/Q2ST7S6W
Potassium voltage-gated channel subfamily H member 2
(Homo sapiens (Human))
BDBM289613
(6-(4-Chlorobenzyl)-9-methyl-8,9,10,11-tetrahydropy...)
Show SMILES CN1CCc2c(C1)sc1n(Cc3ccc(Cl)cc3)c(=O)n3ncnc3c21
Show InChI InChI=1S/C18H16ClN5OS/c1-22-7-6-13-14(9-22)26-17-15(13)16-20-10-21-24(16)18(25)23(17)8-11-2-4-12(19)5-3-11/h2-5,10H,6-9H2,1H3
Reactome pathway
n/an/a 69n/an/an/an/an/an/a
Dart Neuroscience LLC
Curated by ChEMBL
Assay Description
Inhibition of human ERG
J Med Chem 60: 3472-3483 (2017)
Article DOI: 10.1021/acs.jmedchem.7b00302
BindingDB Entry DOI: 10.7270/Q2D79DP3
Calcium/calmodulin-dependent 3',5'-cyclic nucleotide phosphodiesterase 1B
(Homo sapiens (Human))
BDBM289613
(6-(4-Chlorobenzyl)-9-methyl-8,9,10,11-tetrahydropy...)
Show SMILES CN1CCc2c(C1)sc1n(Cc3ccc(Cl)cc3)c(=O)n3ncnc3c21
Show InChI InChI=1S/C18H16ClN5OS/c1-22-7-6-13-14(9-22)26-17-15(13)16-20-10-21-24(16)18(25)23(17)8-11-2-4-12(19)5-3-11/h2-5,10H,6-9H2,1H3
Reactome pathway
n/an/a 1.00E+3n/an/an/an/an/an/a
Dart Neuroscience LLC
Curated by ChEMBL
Assay Description
In vitro inhibitory activity against recombinant human calpain 1
J Med Chem 60: 3472-3483 (2017)
Article DOI: 10.1021/acs.jmedchem.7b00302
BindingDB Entry DOI: 10.7270/Q2D79DP3
cAMP and cAMP-inhibited cGMP 3',5'-cyclic phosphodiesterase 10A
(Homo sapiens (Human))
BDBM289613
(6-(4-Chlorobenzyl)-9-methyl-8,9,10,11-tetrahydropy...)
Show SMILES CN1CCc2c(C1)sc1n(Cc3ccc(Cl)cc3)c(=O)n3ncnc3c21
Show InChI InChI=1S/C18H16ClN5OS/c1-22-7-6-13-14(9-22)26-17-15(13)16-20-10-21-24(16)18(25)23(17)8-11-2-4-12(19)5-3-11/h2-5,10H,6-9H2,1H3
Reactome pathway
n/an/a>1.00E+4n/an/an/an/an/an/a
Dart Neuroscience LLC
Curated by ChEMBL
Assay Description
Inhibition of PDE10A1 (unknown origin) assessed as decrease in FAM-cAMP hydrolysis after 1 hr by IMAP assay
J Med Chem 60: 3472-3483 (2017)
Article DOI: 10.1021/acs.jmedchem.7b00302
BindingDB Entry DOI: 10.7270/Q2D79DP3