BDBM28973 2-{1-[(4-chlorobenzene)sulfonyl]-4-[(trifluoromethane)sulfonylmethyl]cyclohexyl}-1,4-difluorobenzene::cyclohexyl sulfone-based compound, 17
SMILES: Fc1ccc(F)c(c1)[C@]1(CC[C@H](CS(=O)(=O)C(F)(F)F)CC1)S(=O)(=O)c1ccc(Cl)cc1
InChI Key: InChIKey=BCIWPZDEVCOVHV-XVDXERDNSA-N
Data: 1 EC50
Activity Spreadsheet -- Enzyme Inhibition Constant Data from BindingDB
Found 1 hit for monomerid = 28973
Trg + Lig
Ki
nM
ΔG°
kcal/mole
IC50
nM
Kd
nM
EC50/IC50
nM
koff
s-1
kon
M-1s-1
pHTemp
°C
Gamma-Secretase
(Homo sapiens (Human))
BDBM28973
(2-{1-[(4-chlorobenzene)sulfonyl]-4-[(trifluorometh...)
Show SMILES Fc1ccc(F)c(c1)[C@]1(CC[C@H](CS(=O)(=O)C(F)(F)F)CC1)S(=O)(=O)c1ccc(Cl)cc1 |r,wU:11.12,wD:8.8,(-1.46,7.75,;-1.46,6.21,;-2.79,5.44,;-2.79,3.9,;-1.46,3.13,;-1.46,1.59,;-.12,3.9,;-.12,5.44,;1.47,3.37,;2.8,2.6,;4.13,3.37,;4.13,4.91,;5.47,5.68,;6.8,4.91,;6.03,3.58,;7.89,3.82,;8.13,5.68,;9.47,6.45,;7.36,7.02,;8.9,4.35,;2.8,5.68,;1.47,4.91,;1.47,1.83,;3.01,1.83,;-.07,1.83,;1.47,.29,;.13,-.48,;.13,-2.02,;1.47,-2.79,;1.47,-4.33,;2.8,-2.02,;2.8,-.48,)|
Show InChI InChI=1S/C20H18ClF5O4S2/c21-14-1-4-16(5-2-14)32(29,30)19(17-11-15(22)3-6-18(17)23)9-7-13(8-10-19)12-31(27,28)20(24,25)26/h1-6,11,13H,7-10,12H2/t13-,19+
NCI pathway
Reactome pathway
n/an/an/an/a 21.5n/an/an/an/a
Merck Research Laboratories
Assay Description
A whole-cell gamma-secretase inhibition assay using SHSY5Y neuroblastoma cells in which human gamma-secretase catalyzes the breakdown of the overexpr...
Bioorg Med Chem Lett 16: 280-4 (2006)
Article DOI: 10.1016/j.bmcl.2005.10.009
BindingDB Entry DOI: 10.7270/Q22Z13VQ