null
SMILES: Nc1ccc(cn1)-c1c[nH]c(n1)C(Cc1ccccc1)C(=O)N1CCC[C@@]2(C1)OC(=O)Nc1ccc(Cl)c(F)c21
InChI Key:
Activity Spreadsheet -- Enzyme Inhibition Constant Data from BindingDB
Found 1 hit for monomerid = 289821
Trg + Lig
Ki
nM
ΔG°
kcal/mole
IC50
nM
Kd
nM
EC50/IC50
nM
koff
s-1
kon
M-1s-1
pHTemp
°C
Coagulation factor XI
(Homo sapiens (Human))
BDBM289821
(2-(5-(6-aminopyridin-3-yl)-1H-imidazol-2-yl)-3-phe...)
Show SMILES Nc1ccc(cn1)-c1c[nH]c(n1)C(Cc1ccccc1)C(=O)N1CCC[C@@]2(C1)OC(=O)Nc1ccc(Cl)c(F)c21 |r|
Reactome pathway
US Patent
353 -8.80n/an/an/an/an/a7.425
Merck Sharp & Dohme Corp.
US Patent
Assay Description
The effectiveness of a compound of the present invention as an inhibitor of Coagulation Factor XIa can be determined using a relevant purified serine...
US Patent US10093683 (2018)
BindingDB Entry DOI: 10.7270/Q2RR2197