null
SMILES: COC(=O)Nc1ccc2[nH]c(cc2c1)C(Cc1ccccc1)C(=O)N1CCC[C@@]2(C1)OC(=O)Nc1ccc(Cl)c(F)c21
InChI Key:
Activity Spreadsheet -- Enzyme Inhibition Constant Data from BindingDB
Found 1 hit for monomerid = 289833
Trg + Lig
Ki
nM
ΔG°
kcal/mole
IC50
nM
Kd
nM
EC50/IC50
nM
koff
s-1
kon
M-1s-1
pHTemp
°C
Coagulation factor XI
(Homo sapiens (Human))
BDBM289833
(Methyl (2-(1-((R)-6-chloro-5-fluoro-2-oxo-1,2-dihy...)
Show SMILES COC(=O)Nc1ccc2[nH]c(cc2c1)C(Cc1ccccc1)C(=O)N1CCC[C@@]2(C1)OC(=O)Nc1ccc(Cl)c(F)c21 |r|
Reactome pathway
US Patent
>875>-8.26n/an/an/an/an/a7.425
Merck Sharp & Dohme Corp.
US Patent
Assay Description
The effectiveness of a compound of the present invention as an inhibitor of Coagulation Factor XIa can be determined using a relevant purified serine...
US Patent US10093683 (2018)
BindingDB Entry DOI: 10.7270/Q2RR2197