BDBM290232 US9573958, Compound 61
SMILES: C[C@H](NCc1ccc2n(C[C@H]3CCCN3C(=O)C(=CC(C)(C)C)C#N)c(NC(=O)c3ccc(s3)C(F)F)nc2c1)C(C)(C)C
InChI Key: InChIKey=VNEXWKVPCVGXBO-RBQMIPTESA-N
Data: 1 IC50
Activity Spreadsheet -- Enzyme Inhibition Constant Data from BindingDB
Found 1 hit for monomerid = 290232
Trg + Lig
Ki
nM
ΔG°
kcal/mole
IC50
nM
Kd
nM
EC50/IC50
nM
koff
s-1
kon
M-1s-1
pHTemp
°C
Tyrosine-protein kinase ITK/TSK
(Homo sapiens (Human))
BDBM290232
(US9573958, Compound 61)
Show SMILES C[C@H](NCc1ccc2n(C[C@H]3CCCN3C(=O)C(=CC(C)(C)C)C#N)c(NC(=O)c3ccc(s3)C(F)F)nc2c1)C(C)(C)C |w:18.19|
Show InChI InChI=1S/C33H42F2N6O2S/c1-20(33(5,6)7)37-18-21-10-11-25-24(15-21)38-31(39-29(42)27-13-12-26(44-27)28(34)35)41(25)19-23-9-8-14-40(23)30(43)22(17-36)16-32(2,3)4/h10-13,15-16,20,23,28,37H,8-9,14,18-19H2,1-7H3,(H,38,39,42)/b22-16+/t20-,23+/m0/s1
Reactome pathway
US Patent
n/an/a 2.40n/an/an/an/a7.5n/a
PRINCIPIA BIOPHARMA, INC.
US Patent
Assay Description
The ability of the compounds of the present disclosure to inhibit ITK was measured using the Caliper assay format, which is an electrophoretic separa...
US Patent US9573958 (2017)
BindingDB Entry DOI: 10.7270/Q2M047GW