BDBM29025 cyanohydroxybutenamide, 10
SMILES: CC(=O)C(C#N)C(=O)Nc1ccc(cc1)-c1ccccc1
InChI Key: InChIKey=KECIZMPXZLKEHL-UHFFFAOYSA-N
Data: 2 KI  2 IC50
PDB links: 1 PDB ID matches this monomer.
Activity Spreadsheet -- Enzyme Inhibition Constant Data from BindingDB
Found 2 hits for monomerid = 29025
Trg + Lig
Ki
nM
ΔG°
kcal/mole
IC50
nM
Kd
nM
EC50/IC50
nM
koff
s-1
kon
M-1s-1
pHTemp
°C
Dihydroorotate dehydrogenase
(Homo sapiens (Human))
BDBM29025
(cyanohydroxybutenamide, 10)
Show SMILES CC(=O)C(C#N)C(=O)Nc1ccc(cc1)-c1ccccc1
Show InChI InChI=1S/C17H14N2O2/c1-12(20)16(11-18)17(21)19-15-9-7-14(8-10-15)13-5-3-2-4-6-13/h2-10,16H,1H3,(H,19,21)
Reactome pathway
11n/a 90n/an/an/an/an/an/a
University of Leeds
Assay Description
The assays were carried out by using a colorimetric DCIP method, which uses the colorimetric reagent 2, 6-dichlorophenolindophenol as the final elect...
J Med Chem 52: 2683-93 (2009)
Article DOI: 10.1021/jm800963t
BindingDB Entry DOI: 10.7270/Q2PN93ZK
3D
3D Structure (crystal)
Dihydroorotate dehydrogenase (quinone), mitochondrial
(Plasmodium falciparum (isolate 3D7))
BDBM29025
(cyanohydroxybutenamide, 10)
Show SMILES CC(=O)C(C#N)C(=O)Nc1ccc(cc1)-c1ccccc1
Show InChI InChI=1S/C17H14N2O2/c1-12(20)16(11-18)17(21)19-15-9-7-14(8-10-15)13-5-3-2-4-6-13/h2-10,16H,1H3,(H,19,21)
3.00E+3 -7.53 2.57E+4n/an/an/an/a8.025
University of Leeds
Assay Description
The assays were carried out by using a colorimetric DCIP method, which uses the colorimetric reagent 2, 6-dichlorophenolindophenol as the final elect...
J Med Chem 52: 2683-93 (2009)
Article DOI: 10.1021/jm800963t
BindingDB Entry DOI: 10.7270/Q2PN93ZK
3D
3D Structure (docked)