null
SMILES: C[C@H](NCc1ccc2n(C[C@H]3CCCN3C(=O)C(=CC3(C)COC3)C#N)c(NC(=O)c3ccc(s3)C(F)F)nc2c1)C(C)(C)C
InChI Key: InChIKey=RGZZKKVSRWZCTM-PBIRWOPUSA-N
Activity Spreadsheet -- Enzyme Inhibition Constant Data from BindingDB
Found 1 hit for monomerid = 290254
Trg + Lig
Ki
nM
ΔG°
kcal/mole
IC50
nM
Kd
nM
EC50/IC50
nM
koff
s-1
kon
M-1s-1
pHTemp
°C
Tyrosine-protein kinase ITK/TSK
(Homo sapiens (Human))
BDBM290254
(US9573958, Compound 63)
Show SMILES C[C@H](NCc1ccc2n(C[C@H]3CCCN3C(=O)C(=CC3(C)COC3)C#N)c(NC(=O)c3ccc(s3)C(F)F)nc2c1)C(C)(C)C |w:18.19|
Show InChI InChI=1S/C33H40F2N6O3S/c1-20(32(2,3)4)37-16-21-8-9-25-24(13-21)38-31(39-29(42)27-11-10-26(45-27)28(34)35)41(25)17-23-7-6-12-40(23)30(43)22(15-36)14-33(5)18-44-19-33/h8-11,13-14,20,23,28,37H,6-7,12,16-19H2,1-5H3,(H,38,39,42)/b22-14+/t20-,23+/m0/s1
Reactome pathway
US Patent
n/an/a 1.30n/an/an/an/a7.5n/a
PRINCIPIA BIOPHARMA, INC.
US Patent
Assay Description
The ability of the compounds of the present disclosure to inhibit ITK was measured using the Caliper assay format, which is an electrophoretic separa...
US Patent US9573958 (2017)
BindingDB Entry DOI: 10.7270/Q2M047GW