BDBM29028 cyanohydroxybutenamide, 18
SMILES: CC(=O)C(C#N)C(=O)Nc1ccc(cc1C(F)(F)F)-c1ccccc1Cl
InChI Key: InChIKey=BLYQMOIAQKSNEI-UHFFFAOYSA-N
Data: 2 KI  2 IC50
Activity Spreadsheet -- Enzyme Inhibition Constant Data from BindingDB
Found 2 hits for monomerid = 29028
Trg + Lig
Ki
nM
ΔG°
kcal/mole
IC50
nM
Kd
nM
EC50/IC50
nM
koff
s-1
kon
M-1s-1
pHTemp
°C
Dihydroorotate dehydrogenase (quinone), mitochondrial
(Homo sapiens (Human))
BDBM29028
(cyanohydroxybutenamide, 18)
Show SMILES CC(=O)C(C#N)C(=O)Nc1ccc(cc1C(F)(F)F)-c1ccccc1Cl
Show InChI InChI=1S/C18H12ClF3N2O2/c1-10(25)13(9-23)17(26)24-16-7-6-11(8-14(16)18(20,21)22)12-4-2-3-5-15(12)19/h2-8,13H,1H3,(H,24,26)
Reactome pathway
21n/a 170n/an/an/an/an/an/a
University of Leeds
Assay Description
The assays were carried out by using a colorimetric DCIP method, which uses the colorimetric reagent 2, 6-dichlorophenolindophenol as the final elect...
J Med Chem 52: 2683-93 (2009)
Article DOI: 10.1021/jm800963t
BindingDB Entry DOI: 10.7270/Q2PN93ZK
Dihydroorotate dehydrogenase (quinone), mitochondrial
(Plasmodium falciparum (isolate 3D7))
BDBM29028
(cyanohydroxybutenamide, 18)
Show SMILES CC(=O)C(C#N)C(=O)Nc1ccc(cc1C(F)(F)F)-c1ccccc1Cl
Show InChI InChI=1S/C18H12ClF3N2O2/c1-10(25)13(9-23)17(26)24-16-7-6-11(8-14(16)18(20,21)22)12-4-2-3-5-15(12)19/h2-8,13H,1H3,(H,24,26)
730 -8.37 6.20E+3n/an/an/an/a8.025
University of Leeds
Assay Description
The assays were carried out by using a colorimetric DCIP method, which uses the colorimetric reagent 2, 6-dichlorophenolindophenol as the final elect...
J Med Chem 52: 2683-93 (2009)
Article DOI: 10.1021/jm800963t
BindingDB Entry DOI: 10.7270/Q2PN93ZK
3D
3D Structure (docked)