BDBM29029 cyanohydroxybutenamide, 19
SMILES: COc1ccccc1-c1ccc(NC(=O)C(C#N)C(C)=O)c(Cl)c1
InChI Key: InChIKey=TUFJFMVDXYQLBZ-UHFFFAOYSA-N
Data: 2 KI  2 IC50
PDB links: 1 PDB ID matches this monomer.
Activity Spreadsheet -- Enzyme Inhibition Constant Data from BindingDB
Found 2 hits for monomerid = 29029
Trg + Lig
Ki
nM
ΔG°
kcal/mole
IC50
nM
Kd
nM
EC50/IC50
nM
koff
s-1
kon
M-1s-1
pHTemp
°C
Dihydroorotate dehydrogenase
(Homo sapiens (Human))
BDBM29029
(cyanohydroxybutenamide, 19)
Show SMILES COc1ccccc1-c1ccc(NC(=O)C(C#N)C(C)=O)c(Cl)c1
Show InChI InChI=1S/C18H15ClN2O3/c1-11(22)14(10-20)18(23)21-16-8-7-12(9-15(16)19)13-5-3-4-6-17(13)24-2/h3-9,14H,1-2H3,(H,21,23)
Reactome pathway
25n/a 200n/an/an/an/an/an/a
University of Leeds
Assay Description
The assays were carried out by using a colorimetric DCIP method, which uses the colorimetric reagent 2, 6-dichlorophenolindophenol as the final elect...
J Med Chem 52: 2683-93 (2009)
Article DOI: 10.1021/jm800963t
BindingDB Entry DOI: 10.7270/Q2PN93ZK
3D
3D Structure (crystal)
Dihydroorotate dehydrogenase (quinone), mitochondrial
(Plasmodium falciparum (isolate 3D7))
BDBM29029
(cyanohydroxybutenamide, 19)
Show SMILES COc1ccccc1-c1ccc(NC(=O)C(C#N)C(C)=O)c(Cl)c1
Show InChI InChI=1S/C18H15ClN2O3/c1-11(22)14(10-20)18(23)21-16-8-7-12(9-15(16)19)13-5-3-4-6-17(13)24-2/h3-9,14H,1-2H3,(H,21,23)
1.00E+3 -8.18 8.60E+3n/an/an/an/a8.025
University of Leeds
Assay Description
The assays were carried out by using a colorimetric DCIP method, which uses the colorimetric reagent 2, 6-dichlorophenolindophenol as the final elect...
J Med Chem 52: 2683-93 (2009)
Article DOI: 10.1021/jm800963t
BindingDB Entry DOI: 10.7270/Q2PN93ZK