BDBM290324 4-(Piperidin-4-yl)-10-[2-(trifluoromethyl)phenyl]pyrimido[1,2-b]indazol-2(1H)-one hydrochloride::US10098883, Example 67::US10668071, Example 67
SMILES: FC(F)(F)c1ccccc1-c1cccc2nn3c(cc(=O)[nH]c3c12)C1CCNCC1
InChI Key: InChIKey=HRTZQFUZXIJCKY-UHFFFAOYSA-N
Data: 2 IC50
Activity Spreadsheet -- Enzyme Inhibition Constant Data from BindingDB
Found 2 hits for monomerid = 290324
Trg + Lig
Ki
nM
ΔG°
kcal/mole
IC50
nM
Kd
nM
EC50/IC50
nM
koff
s-1
kon
M-1s-1
pHTemp
°C
Plasminogen (aa 101-181)
(Homo sapiens (Human))
BDBM290324
(4-(Piperidin-4-yl)-10-[2-(trifluoromethyl)phenyl]p...)
Show SMILES FC(F)(F)c1ccccc1-c1cccc2nn3c(cc(=O)[nH]c3c12)C1CCNCC1
Show InChI InChI=1S/C22H19F3N4O/c23-22(24,25)16-6-2-1-4-14(16)15-5-3-7-17-20(15)21-27-19(30)12-18(29(21)28-17)13-8-10-26-11-9-13/h1-7,12-13,26H,8-11H2,(H,27,30)
US Patent
n/an/a 13n/an/an/an/an/an/a
BAYER PHARMA AKTIENGESELLSCHAFT
US Patent
Assay Description
The clot-lysis test system configures the kinetics of clot formation and degradation in vitro and allows quantifying modulation of the process by sel...
US Patent US10668071 (2020)
Plasminogen (aa 101-181)
(Homo sapiens (Human))
BDBM290324
(4-(Piperidin-4-yl)-10-[2-(trifluoromethyl)phenyl]p...)
Show SMILES FC(F)(F)c1ccccc1-c1cccc2nn3c(cc(=O)[nH]c3c12)C1CCNCC1
Show InChI InChI=1S/C22H19F3N4O/c23-22(24,25)16-6-2-1-4-14(16)15-5-3-7-17-20(15)21-27-19(30)12-18(29(21)28-17)13-8-10-26-11-9-13/h1-7,12-13,26H,8-11H2,(H,27,30)
US Patent
n/an/a 13n/an/an/an/a7.0n/a
BAYER PHARMA AKTIENGESELLSCHAFT
US Patent
Assay Description
The test compounds were dissolved in 1% acetic acid and further complemented with an equal volume of DMSO. The resulting stock solutions were seriall...
US Patent US10098883 (2018)
BindingDB Entry DOI: 10.7270/Q2G73GSM