BDBM290334 9-Fluoro-10-phenyl-4-(piperidin-4-yl)pyrimido[1,2-b]indazol-2(1H)-one hydrochloride::US10098883, Example 77::US10668071, Example 77
SMILES: Fc1ccc2nn3c(cc(=O)[nH]c3c2c1-c1ccccc1)C1CCNCC1
InChI Key: InChIKey=NORWSQPVXYFCFO-UHFFFAOYSA-N
Data: 2 IC50
Activity Spreadsheet -- Enzyme Inhibition Constant Data from BindingDB
Found 2 hits for monomerid = 290334
Trg + Lig
Ki
nM
ΔG°
kcal/mole
IC50
nM
Kd
nM
EC50/IC50
nM
koff
s-1
kon
M-1s-1
pHTemp
°C
Plasminogen (aa 101-181)
(Homo sapiens (Human))
BDBM290334
(9-Fluoro-10-phenyl-4-(piperidin-4-yl)pyrimido[1,2-...)
Show SMILES Fc1ccc2nn3c(cc(=O)[nH]c3c2c1-c1ccccc1)C1CCNCC1
Show InChI InChI=1S/C21H19FN4O/c22-15-6-7-16-20(19(15)14-4-2-1-3-5-14)21-24-18(27)12-17(26(21)25-16)13-8-10-23-11-9-13/h1-7,12-13,23H,8-11H2,(H,24,27)
US Patent
n/an/a 11n/an/an/an/an/an/a
BAYER PHARMA AKTIENGESELLSCHAFT
US Patent
Assay Description
The clot-lysis test system configures the kinetics of clot formation and degradation in vitro and allows quantifying modulation of the process by sel...
US Patent US10668071 (2020)
Plasminogen (aa 101-181)
(Homo sapiens (Human))
BDBM290334
(9-Fluoro-10-phenyl-4-(piperidin-4-yl)pyrimido[1,2-...)
Show SMILES Fc1ccc2nn3c(cc(=O)[nH]c3c2c1-c1ccccc1)C1CCNCC1
Show InChI InChI=1S/C21H19FN4O/c22-15-6-7-16-20(19(15)14-4-2-1-3-5-14)21-24-18(27)12-17(26(21)25-16)13-8-10-23-11-9-13/h1-7,12-13,23H,8-11H2,(H,24,27)
US Patent
n/an/a 11n/an/an/an/a7.0n/a
BAYER PHARMA AKTIENGESELLSCHAFT
US Patent
Assay Description
The test compounds were dissolved in 1% acetic acid and further complemented with an equal volume of DMSO. The resulting stock solutions were seriall...
US Patent US10098883 (2018)
BindingDB Entry DOI: 10.7270/Q2G73GSM