null
SMILES: N[C@]1(CN(CCCc2ccccc2)C[C@@H]1CCCB(O)O)C(O)=O
InChI Key: InChIKey=BFBKKFNKPSTJIW-RDJZCZTQSA-N
Activity Spreadsheet -- Enzyme Inhibition Constant Data from BindingDB
Found 4 hits for monomerid = 290380
Trg + Lig
Ki
nM
ΔG°
kcal/mole
IC50
nM
Kd
nM
EC50/IC50
nM
koff
s-1
kon
M-1s-1
pHTemp
°C
Arginase-1
(Homo sapiens (Human))
BDBM290380
((3R,4S)-3-amino-4-(3-boronopropyl)-1-(3-(4- carbox...)
Show SMILES N[C@]1(CN(CCCc2ccccc2)C[C@@H]1CCCB(O)O)C(O)=O |r|
Show InChI InChI=1S/C17H27BN2O4/c19-17(16(21)22)13-20(12-15(17)9-4-10-18(23)24)11-5-8-14-6-2-1-3-7-14/h1-3,6-7,15,23-24H,4-5,8-13,19H2,(H,21,22)/t15-,17-/m0/s1
NCI pathway
Reactome pathway
US Patent
n/an/a<250n/an/an/an/a7.425
Mars, Incorporated
US Patent
Assay Description
Inhibition of arginase I (ARG I) and arginase II (ARG II) by Formula I or Formula II compounds is followed spectrophotometrically at 530 nm. The comp...
US Patent US10098902 (2018)
BindingDB Entry DOI: 10.7270/Q2319XXK
Arginase-2, mitochondrial
(Homo sapiens (Human))
BDBM290380
((3R,4S)-3-amino-4-(3-boronopropyl)-1-(3-(4- carbox...)
Show SMILES N[C@]1(CN(CCCc2ccccc2)C[C@@H]1CCCB(O)O)C(O)=O |r|
Show InChI InChI=1S/C17H27BN2O4/c19-17(16(21)22)13-20(12-15(17)9-4-10-18(23)24)11-5-8-14-6-2-1-3-7-14/h1-3,6-7,15,23-24H,4-5,8-13,19H2,(H,21,22)/t15-,17-/m0/s1
Reactome pathway
US Patent
n/an/a 1.00E+3n/an/an/an/an/an/a
Mars, Incorporated
US Patent
Assay Description
Inhibition of arginase I (ARG I) and arginase II (ARG II) by Formula I or Formula II compounds is followed spectrophotometrically at 530 nm. The comp...
US Patent US10603330 (2020)
Arginase-1
(Homo sapiens (Human))
BDBM290380
((3R,4S)-3-amino-4-(3-boronopropyl)-1-(3-(4- carbox...)
Show SMILES N[C@]1(CN(CCCc2ccccc2)C[C@@H]1CCCB(O)O)C(O)=O |r|
Show InChI InChI=1S/C17H27BN2O4/c19-17(16(21)22)13-20(12-15(17)9-4-10-18(23)24)11-5-8-14-6-2-1-3-7-14/h1-3,6-7,15,23-24H,4-5,8-13,19H2,(H,21,22)/t15-,17-/m0/s1
NCI pathway
Reactome pathway
US Patent
n/an/a 1.00E+3n/an/an/an/an/an/a
Mars, Incorporated
US Patent
Assay Description
Inhibition of arginase I (ARG I) and arginase II (ARG II) by Formula I or Formula II compounds is followed spectrophotometrically at 530 nm. The comp...
US Patent US10603330 (2020)
Arginase-2, mitochondrial
(Homo sapiens (Human))
BDBM290380
((3R,4S)-3-amino-4-(3-boronopropyl)-1-(3-(4- carbox...)
Show SMILES N[C@]1(CN(CCCc2ccccc2)C[C@@H]1CCCB(O)O)C(O)=O |r|
Show InChI InChI=1S/C17H27BN2O4/c19-17(16(21)22)13-20(12-15(17)9-4-10-18(23)24)11-5-8-14-6-2-1-3-7-14/h1-3,6-7,15,23-24H,4-5,8-13,19H2,(H,21,22)/t15-,17-/m0/s1
Reactome pathway
US Patent
n/an/a<250n/an/an/an/a7.425
Mars, Incorporated
US Patent
Assay Description
Inhibition of arginase I (ARG I) and arginase II (ARG II) by Formula I or Formula II compounds is followed spectrophotometrically at 530 nm. The comp...
US Patent US10098902 (2018)
BindingDB Entry DOI: 10.7270/Q2319XXK