BDBM290391 (3R,4S)-3-amino-4-(3-boronopropyl)-1,3'-bipyrrolidine-3- carboxylic acid::US10098902, Example 27::US10603330, Example 27
SMILES: N[C@]1(CN(C[C@@H]1CCCB(O)O)C1CCNC1)C(O)=O
InChI Key: InChIKey=QALZCURKZMHVFZ-VULFSTHESA-N
Data: 4 IC50
Activity Spreadsheet -- Enzyme Inhibition Constant Data from BindingDB
Found 4 hits for monomerid = 290391
Trg + Lig
Ki
nM
ΔG°
kcal/mole
IC50
nM
Kd
nM
EC50/IC50
nM
koff
s-1
kon
M-1s-1
pHTemp
°C
Arginase-1
(Homo sapiens (Human))
BDBM290391
((3R,4S)-3-amino-4-(3-boronopropyl)-1,3'-bipyrrolid...)
Show SMILES N[C@]1(CN(C[C@@H]1CCCB(O)O)C1CCNC1)C(O)=O |r|
Show InChI InChI=1S/C12H24BN3O4/c14-12(11(17)18)8-16(10-3-5-15-6-10)7-9(12)2-1-4-13(19)20/h9-10,15,19-20H,1-8,14H2,(H,17,18)/t9-,10?,12-/m0/s1
NCI pathway
Reactome pathway
US Patent
n/an/a<250n/an/an/an/a7.425
Mars, Incorporated
US Patent
Assay Description
Inhibition of arginase I (ARG I) and arginase II (ARG II) by Formula I or Formula II compounds is followed spectrophotometrically at 530 nm. The comp...
US Patent US10098902 (2018)
BindingDB Entry DOI: 10.7270/Q2319XXK
Arginase-2, mitochondrial
(Homo sapiens (Human))
BDBM290391
((3R,4S)-3-amino-4-(3-boronopropyl)-1,3'-bipyrrolid...)
Show SMILES N[C@]1(CN(C[C@@H]1CCCB(O)O)C1CCNC1)C(O)=O |r|
Show InChI InChI=1S/C12H24BN3O4/c14-12(11(17)18)8-16(10-3-5-15-6-10)7-9(12)2-1-4-13(19)20/h9-10,15,19-20H,1-8,14H2,(H,17,18)/t9-,10?,12-/m0/s1
Reactome pathway
US Patent
n/an/a 1.00E+3n/an/an/an/an/an/a
Mars, Incorporated
US Patent
Assay Description
Inhibition of arginase I (ARG I) and arginase II (ARG II) by Formula I or Formula II compounds is followed spectrophotometrically at 530 nm. The comp...
US Patent US10603330 (2020)
Arginase-1
(Homo sapiens (Human))
BDBM290391
((3R,4S)-3-amino-4-(3-boronopropyl)-1,3'-bipyrrolid...)
Show SMILES N[C@]1(CN(C[C@@H]1CCCB(O)O)C1CCNC1)C(O)=O |r|
Show InChI InChI=1S/C12H24BN3O4/c14-12(11(17)18)8-16(10-3-5-15-6-10)7-9(12)2-1-4-13(19)20/h9-10,15,19-20H,1-8,14H2,(H,17,18)/t9-,10?,12-/m0/s1
NCI pathway
Reactome pathway
US Patent
n/an/a 1.00E+3n/an/an/an/an/an/a
Mars, Incorporated
US Patent
Assay Description
Inhibition of arginase I (ARG I) and arginase II (ARG II) by Formula I or Formula II compounds is followed spectrophotometrically at 530 nm. The comp...
US Patent US10603330 (2020)
Arginase-2, mitochondrial
(Homo sapiens (Human))
BDBM290391
((3R,4S)-3-amino-4-(3-boronopropyl)-1,3'-bipyrrolid...)
Show SMILES N[C@]1(CN(C[C@@H]1CCCB(O)O)C1CCNC1)C(O)=O |r|
Show InChI InChI=1S/C12H24BN3O4/c14-12(11(17)18)8-16(10-3-5-15-6-10)7-9(12)2-1-4-13(19)20/h9-10,15,19-20H,1-8,14H2,(H,17,18)/t9-,10?,12-/m0/s1
Reactome pathway
US Patent
n/an/a<250n/an/an/an/a7.425
Mars, Incorporated
US Patent
Assay Description
Inhibition of arginase I (ARG I) and arginase II (ARG II) by Formula I or Formula II compounds is followed spectrophotometrically at 530 nm. The comp...
US Patent US10098902 (2018)
BindingDB Entry DOI: 10.7270/Q2319XXK