BDBM29065 lactam-based compound, 12d
SMILES: CC(C)CN1CCc2c(nn(c2-c2ccc(Cl)cc2)-c2ccccc2Cl)C1=O
InChI Key: InChIKey=WRYHYMZLAAULED-UHFFFAOYSA-N
Data: 2 KI  1 EC50
Activity Spreadsheet -- Enzyme Inhibition Constant Data from BindingDB
Found 2 hits for monomerid = 29065
Trg + Lig
Ki
nM
ΔG°
kcal/mole
IC50
nM
Kd
nM
EC50/IC50
nM
koff
s-1
kon
M-1s-1
pHTemp
°C
Cannabinoid receptor 1
(Homo sapiens (Human))
BDBM29065
(lactam-based compound, 12d)
Show SMILES CC(C)CN1CCc2c(nn(c2-c2ccc(Cl)cc2)-c2ccccc2Cl)C1=O
Show InChI InChI=1S/C22H21Cl2N3O/c1-14(2)13-26-12-11-17-20(22(26)28)25-27(19-6-4-3-5-18(19)24)21(17)15-7-9-16(23)10-8-15/h3-10,14H,11-13H2,1-2H3
NCI pathway
Reactome pathway
2.5 -11.9n/an/a 9.80n/an/a7.430
Pfizer
Assay Description
IC50 values for test compounds were determined from nonlinear regression analysis of data collected from ligand binding experiments. The inhibition c...
J Med Chem 52: 2652-5 (2009)
Article DOI: 10.1021/jm900255t
BindingDB Entry DOI: 10.7270/Q2F47MGD
Cannabinoid receptor 2
(Homo sapiens (Human))
BDBM29065
(lactam-based compound, 12d)
Show SMILES CC(C)CN1CCc2c(nn(c2-c2ccc(Cl)cc2)-c2ccccc2Cl)C1=O
Show InChI InChI=1S/C22H21Cl2N3O/c1-14(2)13-26-12-11-17-20(22(26)28)25-27(19-6-4-3-5-18(19)24)21(17)15-7-9-16(23)10-8-15/h3-10,14H,11-13H2,1-2H3
Reactome pathway
1.78E+3n/an/an/an/an/an/an/an/a
Pfizer
Assay Description
IC50 values for test compounds were determined from nonlinear regression analysis of data collected from ligand binding experiments. The inhibition c...
J Med Chem 52: 2652-5 (2009)
Article DOI: 10.1021/jm900255t
BindingDB Entry DOI: 10.7270/Q2F47MGD