BDBM29083 Impulsin::MimyX::Palmidrol::Palmityoletanolamide (PEA)
SMILES: CCCCCCCCCCCCCCCC(=O)NCCO
InChI Key: InChIKey=HXYVTAGFYLMHSO-UHFFFAOYSA-N
Data: 2 KI  3 IC50  1 EC50
Activity Spreadsheet -- Enzyme Inhibition Constant Data from BindingDB
Found 6 hits for monomerid = 29083
Trg + Lig
Ki
nM
ΔG°
kcal/mole
IC50
nM
Kd
nM
EC50/IC50
nM
koff
s-1
kon
M-1s-1
pHTemp
°C
Cannabinoid receptor 1
(Homo sapiens (Human))
BDBM29083
(Impulsin | MimyX | Palmidrol | Palmityoletanolamid...)
Show SMILES CCCCCCCCCCCCCCCC(=O)NCCO
Show InChI InChI=1S/C18H37NO2/c1-2-3-4-5-6-7-8-9-10-11-12-13-14-15-18(21)19-16-17-20/h20H,2-17H2,1H3,(H,19,21)
NCI pathway
Reactome pathway
>5.00E+3>-7.35n/an/an/an/an/a7.430
Universita del Piemonte Orientale
Assay Description
IC50 values for test compounds were determined from nonlinear regression analysis of data collected from ligand displacement experiments. The inhibit...
J Med Chem 52: 3001-9 (2009)
Article DOI: 10.1021/jm900130m
BindingDB Entry DOI: 10.7270/Q29G5K4Z
Cannabinoid receptor 2
(Homo sapiens (Human))
BDBM29083
(Impulsin | MimyX | Palmidrol | Palmityoletanolamid...)
Show SMILES CCCCCCCCCCCCCCCC(=O)NCCO
Show InChI InChI=1S/C18H37NO2/c1-2-3-4-5-6-7-8-9-10-11-12-13-14-15-18(21)19-16-17-20/h20H,2-17H2,1H3,(H,19,21)
Reactome pathway
>5.00E+3>-7.35n/an/an/an/an/a7.430
Universita del Piemonte Orientale
Assay Description
IC50 values for test compounds were determined from nonlinear regression analysis of data collected from ligand displacement experiments. The inhibit...
J Med Chem 52: 3001-9 (2009)
Article DOI: 10.1021/jm900130m
BindingDB Entry DOI: 10.7270/Q29G5K4Z
Vanilloid receptor
(Rattus norvegicus)
BDBM29083
(Impulsin | MimyX | Palmidrol | Palmityoletanolamid...)
Show SMILES CCCCCCCCCCCCCCCC(=O)NCCO
Show InChI InChI=1S/C18H37NO2/c1-2-3-4-5-6-7-8-9-10-11-12-13-14-15-18(21)19-16-17-20/h20H,2-17H2,1H3,(H,19,21)
Reactome pathway
n/an/a>1.00E+4n/an/an/an/an/an/a
National Research Council (CNR)
Curated by ChEMBL
Assay Description
Antagonist activity at recombinant rat TRPV2 expressed in HEK293 cells assessed as inhibition of CBD-induced Ca2+ levels preincubated for 5 mins foll...
J Med Chem 61: 8255-8281 (2018)
Article DOI: 10.1021/acs.jmedchem.8b00734
BindingDB Entry DOI: 10.7270/Q2222XFP
Fatty-acid amide hydrolase 1 (aa 30-579)
(Rattus norvegicus (rat))
BDBM29083
(Impulsin | MimyX | Palmidrol | Palmityoletanolamid...)
Show SMILES CCCCCCCCCCCCCCCC(=O)NCCO
Show InChI InChI=1S/C18H37NO2/c1-2-3-4-5-6-7-8-9-10-11-12-13-14-15-18(21)19-16-17-20/h20H,2-17H2,1H3,(H,19,21)
n/an/a 5.01E+3n/an/an/an/an/an/a
Ghent University
Curated by ChEMBL
Assay Description
Inhibition of rat recombinant FAAH assessed as [3H]AEA hydrolysis
Bioorg Med Chem 17: 49-56 (2008)
Article DOI: 10.1016/j.bmc.2008.11.019
BindingDB Entry DOI: 10.7270/Q20C4VMB
Vanilloid receptor
(Rattus norvegicus)
BDBM29083
(Impulsin | MimyX | Palmidrol | Palmityoletanolamid...)
Show SMILES CCCCCCCCCCCCCCCC(=O)NCCO
Show InChI InChI=1S/C18H37NO2/c1-2-3-4-5-6-7-8-9-10-11-12-13-14-15-18(21)19-16-17-20/h20H,2-17H2,1H3,(H,19,21)
Reactome pathway
n/an/a>1.00E+4n/an/an/an/an/an/a
National Research Council (CNR)
Curated by ChEMBL
Assay Description
Antagonist activity at recombinant rat TRPV2 expressed in HEK293 cells assessed as inhibition of LPC-induced Ca2+ levels preincubated for 5 mins foll...
J Med Chem 61: 8255-8281 (2018)
Article DOI: 10.1021/acs.jmedchem.8b00734
BindingDB Entry DOI: 10.7270/Q2222XFP
Transient receptor potential cation channel subfamily V member 1
(Homo sapiens (Human))
BDBM29083
(Impulsin | MimyX | Palmidrol | Palmityoletanolamid...)
Show SMILES CCCCCCCCCCCCCCCC(=O)NCCO
Show InChI InChI=1S/C18H37NO2/c1-2-3-4-5-6-7-8-9-10-11-12-13-14-15-18(21)19-16-17-20/h20H,2-17H2,1H3,(H,19,21)
Reactome pathway
n/an/an/an/a>1.00E+4n/an/an/an/a
Universita del Piemonte Orientale
Assay Description
The effect of the substances on Ca2+ influx was determined by using HEK-293 cells stably overexpressing recombinant human TRPV1 cDNA. The cells were ...
J Med Chem 52: 3001-9 (2009)
Article DOI: 10.1021/jm900130m
BindingDB Entry DOI: 10.7270/Q29G5K4Z